1 10 20
100 200 125
201 210 89
900 1000 174
5 25 24
50 100 119
20 80 116
75 150 122
200 400 144
750 1000 179
2809 9927 262
6449 7081 257
5159 2926 238
3594 2507 217
6972 5304 262
8194 6314 257
1153 6176 262
7751 4309 262
2821 4773 238
5204 8969 262
4905 3749 215
6279 5057 262
4221 1464 238
3840 2157 238
9356 8388 260
8776 9942 260
6199 8140 257
684 5012 238
6252 3054 262
2880 3894 238
9694 350 262
8717 7414 252
1027 5388 238
2324 373 183
2549 6781 262
7368 3063 262
3471 7378 262
4446 2006 238
6011 7524 262
486 7154 262
6986 3643 262
7749 7404 239
6739 9711 260
1802 4878 238
1807 2674 209
8107 7935 252
6095 1258 238
5062 9626 262
3141 5481 238
1042 9533 262
1330 3100 217
5827 1106 238
6827 1062 262
4668 6452 262
9428 1935 262
9686 824 262
4765 5328 210
9300 6821 260
873 9872 262
6121 1044 238
1100 7939 262
4770 1778 238
7841 2457 262
1916 1321 180
3711 1707 238
9431 1936 262
1273 9974 262
5047 2132 238
4759 8759 262
245 4179 238
8054 6614 257
4572 160 238
2172 726 182
3897 709 238
6166 4372 236
3316 2188 217
5383 9740 262
1590 5592 238
8914 5217 262
7154 7630 239
4920 8355 262
2355 6596 262
2340 2448 165
1043 1437 182
8667 1356 262
3813 109 238
2709 3995 238
5693 9092 262
5349 7707 262
8985 9740 260
1132 3050 217
8299 2524 262
9011 3003 262
3859 3819 176
2925 932 217
8071 2379 262
9605 4299 262
2433 3458 217
6753 4440 262
6345 3604 262
4291 5250 215
8210 9320 260
8917 7158 252
5677 991 238
614 8996 262
4318 7170 262
1000 6081 238
8025 9387 260
1553 4403 238
3705 1578 217
