1 1 1
3 3 8
4 4 3
5 5 6
6 6 9
7 7 17
8 8 4
16 16 5
30 30 19
31 31 107
32 32 6
33 33 27
64 64 7
9 9 20
10 10 7
14 14 18
142 142 104
1 10 20
100 200 125
201 210 89
900 1000 174
23 415 144
348 698 145
12321 32932 308
439 12038 268
21903 10284 279
33 90 116
589 9041 262
893 893 73
213 214 102
1 1 1
999999 999999 259
1 2 2
999998 999999 259
2819 23892 282
839 904 179
45 89 116
478 281 144
832 907 179
1298 1899 180
9 17 20
398 3210 217
129 894 179
7485 29845 308
89428 9812 351
7854 47838 324
23984 42722 324
988 2814 209
839 7329 262
573 891 179
8959 9842 260
3981 8503 262
38923 59843 340
8933 9023 247
985 9837 262
398 8942 262
39831 98531 351
1293 29834 308
2984 9028 262
99289 98472 328
563 3298 217
736 8932 262
1092 9837 262
7802 8922 252
122983 122984 150
49883 94233 351
2198 4785 238
129 927 179
2398 8752 262
10294 9341 242
21984 49822 324
32892 42944 324
90389 91012 271
289 398 144
10 98 119
1 99999 351
127 1927 182
2989 2982 142
192 2198 182
4894 6982 262
12984 48922 324
957 1092 169
4984 9582 262
24 4894 238
2948 49100 324
109 2894 209
9128 30292 308
85 751 171
298 849 171
41 894 179
19284 29842 308
6893 29011 308
498 2894 209
951 4812 238
12094 48693 324
312 891 179
5389 49714 324
32129 73393 340
192 894 179
5 412 144
3298 5712 238
12982 48944 324
3209 4829 238
78 938 179
892 4892 238
238 474 144
12984 49822 324
929 4181 238
992 10283 262
584943 586842 359
2912 3021 217
22 222 125
55 5555 238
21 929 179
509 7821 262
1928 4822 238
2832 2982 217
694 8392 262
3985 5983 236
9000 10000 260
738 2178 182
1298 2198 180
298 398 144
94 478 144
12 129 122
19 199 125
904 921 130
89989 90000 196
29 292 128
9082 10000 260
91 892 179
1958 2023 175
16 5 20
1 999999 525
999999 999000 396
