[gd_scene load_steps=4 format=3 uid="uid://cr8817sagkqvq"]

[ext_resource type="Script" path="res://scripts/spike.gd" id="1_8i7vw"]
[ext_resource type="Texture2D" uid="uid://b8r4xlysmkp6i" path="res://images/spike.png" id="2_6ettm"]

[sub_resource type="RectangleShape2D" id="RectangleShape2D_y8lag"]
size = Vector2(31, 16)

[node name="spike" type="Area2D"]
script = ExtResource("1_8i7vw")

[node name="Sprite2D" type="Sprite2D" parent="."]
texture_filter = 1
texture = ExtResource("2_6ettm")

[node name="CollisionShape2D" type="CollisionShape2D" parent="."]
position = Vector2(-0.5, 8)
shape = SubResource("RectangleShape2D_y8lag")

[connection signal="body_shape_entered" from="." to="." method="_on_body_shape_entered"]
