[gd_scene load_steps=4 format=3 uid="uid://dey5mun0sx6k6"]

[ext_resource type="Script" path="res://scenes/insel.gd" id="1_pj51d"]
[ext_resource type="Texture2D" uid="uid://bvxs3us5wn3rq" path="res://assets/player/island4.png" id="1_tjux5"]

[sub_resource type="RectangleShape2D" id="RectangleShape2D_qttqv"]
size = Vector2(251, 62)

[node name="insel" type="StaticBody2D"]
script = ExtResource("1_pj51d")

[node name="Sprite2D" type="Sprite2D" parent="."]
texture_filter = 1
scale = Vector2(4, 4)
texture = ExtResource("1_tjux5")

[node name="CollisionShape2D" type="CollisionShape2D" parent="."]
position = Vector2(0.5, -1)
shape = SubResource("RectangleShape2D_qttqv")
