[gd_scene load_steps=7 format=3 uid="uid://ctfi1hn025w7t"]

[ext_resource type="Script" path="res://scripts/door.gd" id="1_1lafu"]
[ext_resource type="Texture2D" uid="uid://bkvd7wikgd22x" path="res://images/door.png" id="2_qtygy"]

[sub_resource type="RectangleShape2D" id="RectangleShape2D_m05u4"]
size = Vector2(23, 8)

[sub_resource type="AtlasTexture" id="AtlasTexture_tvj7n"]
atlas = ExtResource("2_qtygy")
region = Rect2(32, 0, 32, 64)

[sub_resource type="AtlasTexture" id="AtlasTexture_2m6s8"]
atlas = ExtResource("2_qtygy")
region = Rect2(0, 0, 32, 64)

[sub_resource type="SpriteFrames" id="SpriteFrames_a3nm5"]
animations = [{
"frames": [{
"duration": 1.0,
"texture": SubResource("AtlasTexture_tvj7n")
}],
"loop": true,
"name": &"closed",
"speed": 5.0
}, {
"frames": [{
"duration": 1.0,
"texture": SubResource("AtlasTexture_2m6s8")
}],
"loop": true,
"name": &"ready",
"speed": 5.0
}]

[node name="door" type="Area2D"]
script = ExtResource("1_1lafu")

[node name="CollisionShape2D" type="CollisionShape2D" parent="."]
position = Vector2(-0.5, 1)
shape = SubResource("RectangleShape2D_m05u4")

[node name="AnimatedSprite2D" type="AnimatedSprite2D" parent="."]
texture_filter = 1
sprite_frames = SubResource("SpriteFrames_a3nm5")
animation = &"closed"

[connection signal="body_entered" from="." to="." method="_on_body_entered"]
[connection signal="body_shape_entered" from="." to="." method="_on_body_shape_entered"]
