[gd_scene load_steps=10 format=3 uid="uid://cbgmimcbl7sdc"]

[ext_resource type="TileSet" uid="uid://bxie0by0aiitg" path="res://tileset.tres" id="1_2rl6k"]
[ext_resource type="Script" path="res://start.gd" id="1_fvtle"]
[ext_resource type="FontFile" uid="uid://dvv5ud1ix5dji" path="res://images/m5x7.ttf" id="3_f6s8w"]
[ext_resource type="Texture2D" uid="uid://bkvd7wikgd22x" path="res://images/door.png" id="5_jw2xu"]
[ext_resource type="Texture2D" uid="uid://b8r4xlysmkp6i" path="res://images/spike.png" id="6_osnhw"]
[ext_resource type="Texture2D" uid="uid://481uqjyjlufj" path="res://images/player1.png" id="7_fylca"]
[ext_resource type="Texture2D" uid="uid://d04ybyp7i5fx7" path="res://images/key.png" id="7_v47uj"]
[ext_resource type="Texture2D" uid="uid://bthx0axpevhpx" path="res://images/diamond.png" id="8_pfbvn"]

[sub_resource type="AtlasTexture" id="AtlasTexture_xuis4"]
atlas = ExtResource("5_jw2xu")
region = Rect2(32, 0, 32, 64)

[node name="Node2D" type="Node2D"]
script = ExtResource("1_fvtle")

[node name="TileMap" type="TileMap" parent="."]
texture_filter = 1
tile_set = ExtResource("1_2rl6k")
format = 2
layer_0/tile_data = PackedInt32Array(0, 65538, 1, 1, 2, 3, 65537, 131074, 1, 65536, 65538, 1, 131071, 2, 1, 65535, 2, 1, -1, 2, 1, -65536, 65538, 1, -65535, 65538, 1, 131073, 131074, 1, 131072, 65538, 1, 196607, 2, 1, 196609, 131074, 1, 196608, 65538, 1, 262143, 2, 1, 262145, 131074, 1, 262144, 65538, 1, 327679, 2, 1, 327681, 131074, 1, 327680, 65538, 1, 393215, 2, 1, 393217, 131074, 1, 393216, 65538, 1, 458751, 2, 1, 458752, 65538, 1, 458753, 131074, 1, 524287, 2, 1, 524289, 131074, 1, 524288, 65538, 1, 589823, 2, 1, 589824, 65538, 1, 589825, 131074, 1, 655359, 2, 1, 655361, 131074, 1, 655360, 65538, 1, 720895, 2, 1, 720896, 65538, 1, 720897, 131074, 1, 786431, 2, 1, 786433, 2, 4, 786432, 65538, 1, 851967, 65538, 4, 851969, 65538, 1, 851968, 65538, 1, 917503, 65538, 1, 851970, 131074, 1, 917506, 131074, 1, 917505, 65538, 1, 917504, 65538, 1, 786434, 131074, 0, 983042, 131074, 1, 983041, 65538, 1, 983040, 65538, 1, 1048578, 131074, 1, 1048577, 65538, 1, 1048576, 65538, 1, 1114114, 131074, 1, 1114113, 65538, 1, 1114112, 65538, 1, 1179650, 131074, 1, 1179649, 65538, 1, 1179648, 65538, 1, 1245186, 131074, 1, 1245185, 65538, 1, 1245184, 65538, 1, 1310722, 131074, 1, 1310721, 65538, 1, 1310720, 65538, 1, 1376258, 2, 4, 1376257, 65538, 1, 1376256, 65538, 1, 1441794, 65538, 1, 1441793, 65538, 1, 1441792, 65538, 1, 1507327, 2, 1, 1441791, 2, 1, 1376255, 2, 1, 1507329, 65538, 2, 1507328, 65538, 2, 1572863, 2, 2, 1310719, 65538, 3, 1245183, 65538, 1, 1179647, 65538, 1, 1310718, 2, 2, 1245182, 2, 1, 1179646, 2, 1, 1114110, 2, 1, 1114111, 65538, 1, 1048574, 2, 1, 1048575, 65538, 1, 983038, 2, 1, 983039, 65538, 1, 917502, 2, 1, 851966, 2, 0, 1507330, 65538, 2, 1441795, 65538, 1, 1507331, 65538, 2, 1376259, 65538, 0, 1441796, 65538, 1, 1507332, 65538, 2, 1376260, 65538, 0, 1441797, 65538, 1, 1507333, 65538, 2, 1376261, 65538, 0, 1441798, 65538, 1, 1507334, 65538, 2, 1376262, 65538, 0, 1441799, 65538, 1, 1507335, 65538, 2, 1376263, 65538, 0, 1441800, 65538, 1, 1507336, 65538, 2, 1376264, 65538, 0, 1441801, 65538, 1, 1507337, 65538, 2, 1376265, 65538, 0, 1441802, 65538, 1, 1507338, 65538, 2, 1376266, 65538, 0, 1441803, 65538, 1, 1507339, 65538, 2, 1376267, 65538, 0, 1441804, 65538, 1, 1507340, 65538, 2, 1376268, 65538, 0, 1441805, 65538, 1, 1507341, 65538, 2, 1376269, 65538, 0, 1441806, 65538, 1, 1507342, 65538, 2, 1376270, 65538, 0, 1441807, 65538, 1, 1507343, 65538, 2, 1376271, 65538, 0, 1441808, 65538, 1, 1507344, 65538, 2, 1376272, 65538, 0, 1441809, 65538, 1, 1507345, 65538, 2, 1376273, 65538, 0, 1441810, 65538, 1, 1507346, 65538, 2, 1376274, 65538, 0, 1441811, 65538, 1, 1507347, 65538, 2, 1376275, 65538, 0, 1441812, 65538, 1, 1507348, 65538, 2, 1376276, 65538, 0, 1441813, 65538, 1, 1507349, 65538, 2, 1376277, 65538, 0, 1441814, 65538, 1, 1507350, 65538, 2, 1376278, 65538, 0, 1441815, 65538, 1, 1507351, 65538, 2, 1376279, 65538, 0, 1441816, 65538, 1, 1507352, 65538, 2, 1376280, 65538, 0, 1441817, 65538, 1, 1507353, 65538, 2, 1376281, 65538, 0, 1441818, 65538, 1, 1507354, 65538, 2, 1376282, 65538, 0, 1441819, 65538, 1, 1507355, 65538, 2, 1376283, 65538, 0, 1441820, 65538, 1, 1507356, 65538, 2, 1376284, 65538, 0, 1441821, 65538, 1, 1507357, 65538, 2, 1376285, 65538, 4, 1441822, 65538, 1, 1507358, 65538, 2, 1376286, 65538, 1, 1441823, 65538, 1, 1507359, 65538, 2, 1376287, 65538, 1, 1310749, 2, 0, 1310750, 65538, 0, 1310751, 65538, 0, 1376288, 65538, 1, 1441824, 65538, 1, 1310752, 65538, 0, 1376289, 65538, 1, 1441825, 65538, 1, 1310753, 65538, 0, 1376290, 65538, 1, 1441826, 65538, 1, 1310754, 65538, 0, 1376291, 65538, 1, 1441827, 65538, 1, 1310755, 65538, 0, 1376292, 65538, 1, 1441828, 65538, 1, 1310756, 65538, 0, 1507364, 65538, 2, 1507363, 65538, 2, 1507362, 65538, 2, 1441829, 65538, 1, 1507365, 65538, 2, 1376293, 65538, 1, 1441830, 65538, 1, 1507366, 65538, 2, 1376294, 65538, 1, 1441831, 65538, 1, 1507367, 65538, 2, 1376295, 65538, 1, 1441832, 65538, 1, 1507368, 65538, 2, 1376296, 2, 4, 1441833, 65538, 1, 1507369, 65538, 2, 1376297, 65538, 1, 1441834, 131074, 1, 1507370, 131074, 2, 1376298, 131074, 1, 1310757, 65538, 0, 1310758, 65538, 0, 1507361, 65538, 2, 1507360, 65538, 2, 1310759, 65538, 0, 1310760, 2, 1, 1310761, 65538, 1, 1310762, 2, 3, 1245224, 2, 1, 1245225, 65538, 1, 1245226, 65538, 1, 1179688, 2, 0, 1179689, 65538, 4, 1179690, 65538, 1, 1245227, 131074, 1, 1310763, 131074, 2, 1179691, 131074, 1, 1114153, 2, 1, 1114154, 65538, 1, 1114155, 131074, 1, 1048617, 2, 1, 1048618, 65538, 1, 1048619, 131074, 1, 983081, 2, 1, 983082, 65538, 1, 983083, 131074, 1, 917545, 2, 1, 917546, 65538, 1, 917547, 131074, 1, 852009, 2, 1, 852010, 65538, 1, 852011, 131074, 1, 786473, 65538, 3, 786474, 65538, 1, 786475, 131074, 1, 720937, 65538, 1, 720938, 2, 4, 720939, 131074, 0, 786472, 2, 2, 720936, 2, 1, 655400, 2, 1, 655401, 65538, 1, 655402, 131074, 1, 589864, 2, 1, 589865, 65538, 1, 589866, 131074, 1, 524328, 2, 1, 524329, 65538, 1, 524330, 131074, 1, 458792, 2, 1, 458793, 65538, 1, 458794, 131074, 1, 393256, 2, 1, 393257, 65538, 1, 393258, 131074, 1, 327720, 2, 1, 327721, 65538, 1, 327722, 131074, 1, 262184, 2, 1, 262185, 65538, 1, 262186, 131074, 1, 196648, 2, 1, 196649, 65538, 1, 196650, 131074, 1, 131112, 65538, 3, 131113, 65538, 1, 131114, 131074, 1, 65576, 65538, 1, 65577, 65538, 1, 65578, 131074, 1, 40, 65538, 1, 41, 2, 4, 42, 131074, 0, 131111, 2, 2, 65575, 2, 1, 39, 65538, 3, -65497, 65538, 1, -65496, 65538, 1, -65495, 131074, 1, -131033, 65538, 0, -131032, 65538, 0, -131031, 131074, 0, 38, 65538, 2, -65498, 65538, 1, -131034, 65538, 0, 37, 65538, 2, -65499, 65538, 1, -131035, 65538, 0, 36, 65538, 2, -65500, 65538, 1, -131036, 65538, 0, 35, 65538, 2, -65501, 65538, 1, -131037, 65538, 0, 34, 65538, 2, -65502, 65538, 1, -131038, 65538, 0, 33, 65538, 2, -65503, 65538, 1, -131039, 65538, 0, 32, 65538, 2, -65504, 65538, 1, -131040, 65538, 0, 31, 65538, 2, -65505, 65538, 1, -131041, 65538, 0, 30, 65538, 2, -65506, 65538, 1, -131042, 65538, 0, 29, 65538, 2, -65507, 65538, 1, -131043, 65538, 0, 28, 65538, 2, -65508, 65538, 1, -131044, 65538, 0, 27, 65538, 2, -65509, 65538, 1, -131045, 65538, 0, 26, 65538, 2, -65510, 65538, 1, -131046, 65538, 0, 25, 65538, 2, -65511, 65538, 1, -131047, 65538, 0, 24, 65538, 2, -65512, 65538, 1, -131048, 65538, 0, 23, 65538, 2, -65513, 65538, 1, -131049, 65538, 0, 22, 65538, 2, -65514, 65538, 1, -131050, 65538, 0, 21, 65538, 2, -65515, 65538, 1, -131051, 65538, 0, 20, 65538, 2, -65516, 65538, 1, -131052, 65538, 0, 19, 65538, 2, -65517, 65538, 1, -131053, 65538, 0, 18, 65538, 2, -65518, 65538, 1, -131054, 65538, 0, 17, 65538, 2, -65519, 65538, 1, -131055, 65538, 0, 16, 65538, 2, -65520, 65538, 1, -131056, 65538, 0, 15, 65538, 2, -65521, 65538, 1, -131057, 65538, 0, 14, 65538, 2, -65522, 65538, 1, -131058, 65538, 0, 13, 65538, 2, -65523, 65538, 1, -131059, 65538, 0, 12, 65538, 2, -65524, 65538, 1, -131060, 65538, 0, 11, 65538, 2, -65525, 65538, 1, -131061, 65538, 0, 10, 65538, 2, -65526, 65538, 1, -131062, 65538, 0, 9, 65538, 2, -65527, 65538, 1, -131063, 65538, 0, 8, 65538, 2, -65528, 65538, 1, -131064, 65538, 0, 7, 65538, 2, -65529, 65538, 1, -131065, 65538, 0, 6, 65538, 2, -65530, 65538, 1, -131066, 65538, 0, 5, 65538, 2, -65531, 65538, 1, -131067, 65538, 0, 4, 65538, 2, -65532, 65538, 1, -131068, 65538, 0, 3, 65538, 2, -65533, 65538, 1, -131069, 65538, 0, 2, 65538, 2, -65534, 65538, 1, -131070, 65538, 0, -131071, 65538, 0, -131072, 65538, 0, -65537, 2, 0, 458762, 65538, 1, 458763, 2, 3, 524299, 131074, 1, 524298, 65538, 1, 524297, 2, 1, 458761, 2, 1, 393225, 2, 0, 393226, 65538, 4, 393227, 65538, 1, 589835, 131074, 1, 589834, 65538, 1, 589833, 2, 1, 655371, 131074, 1, 655370, 65538, 1, 655369, 2, 1, 720907, 131074, 1, 720906, 65538, 1, 720905, 2, 1, 786443, 131074, 1, 786442, 65538, 1, 786441, 2, 1, 851979, 131074, 1, 851978, 65538, 1, 851977, 2, 1, 917515, 131074, 1, 917514, 65538, 1, 917513, 2, 1, 983051, 131074, 1, 983050, 65538, 1, 983049, 2, 1, 1048587, 131074, 1, 1048586, 65538, 1, 1048585, 2, 1, 1114123, 2, 4, 1114122, 65538, 1, 1114121, 2, 1, 1179659, 65538, 1, 1179658, 65538, 1, 1179657, 2, 1, 1245195, 65538, 2, 1245194, 65538, 2, 1245193, 2, 2, 1179660, 65538, 1, 1245196, 65538, 2, 1114124, 65538, 0, 1179661, 65538, 1, 1245197, 65538, 2, 1114125, 65538, 0, 1179662, 65538, 1, 1245198, 65538, 2, 1114126, 65538, 0, 1179663, 65538, 1, 1245199, 65538, 2, 1114127, 65538, 0, 1179664, 65538, 1, 1245200, 65538, 2, 1114128, 65538, 0, 1179665, 65538, 1, 1245201, 65538, 3, 1114129, 65538, 0, 1179666, 65538, 1, 1245202, 65538, 1, 1114130, 65538, 0, 1179667, 65538, 1, 1245203, 65538, 1, 1114131, 65538, 0, 1310739, 65538, 2, 1310738, 65538, 2, 1310737, 2, 2, 1245204, 65538, 1, 1310740, 65538, 2, 1179668, 65538, 1, 1245205, 65538, 1, 1310741, 65538, 2, 1179669, 65538, 1, 1245206, 65538, 1, 1310742, 65538, 2, 1179670, 65538, 1, 1245207, 65538, 1, 1310743, 65538, 2, 1179671, 65538, 1, 1245208, 65538, 1, 1310744, 65538, 2, 1179672, 65538, 1, 1245209, 65538, 1, 1310745, 65538, 2, 1179673, 65538, 1, 1245210, 2, 3, 1310746, 131074, 2, 1179674, 65538, 1, 1114136, 65538, 1, 1114137, 65538, 1, 1114138, 65538, 1, 1179675, 65538, 1, 1245211, 65538, 2, 1114139, 65538, 1, 1179676, 65538, 1, 1245212, 65538, 2, 1114140, 65538, 1, 1179677, 65538, 1, 1245213, 65538, 2, 1114141, 65538, 1, 1179678, 65538, 1, 1245214, 65538, 2, 1114142, 65538, 1, 1179679, 131074, 1, 1245215, 131074, 2, 1114143, 131074, 1, 1048603, 65538, 0, 1048604, 65538, 0, 1048605, 65538, 4, 1048602, 65538, 0, 1048601, 65538, 0, 1048600, 65538, 0, 1114135, 65538, 1, 1048599, 65538, 0, 1114134, 65538, 1, 1048598, 65538, 0, 1114133, 65538, 1, 1048597, 65538, 0, 1114132, 65538, 4, 1048596, 2, 0, 1048606, 65538, 1, 1048607, 131074, 1, 983069, 2, 1, 983070, 65538, 1, 983071, 131074, 1, 917533, 2, 1, 917534, 65538, 1, 917535, 131074, 1, 851997, 2, 1, 851998, 65538, 1, 851999, 131074, 1, 786461, 2, 1, 786462, 65538, 1, 786463, 131074, 1, 720925, 2, 1, 720926, 65538, 1, 720927, 131074, 1, 655389, 2, 1, 655390, 65538, 1, 655391, 131074, 1, 589853, 2, 1, 589854, 65538, 1, 589855, 131074, 1, 524317, 65538, 3, 524318, 65538, 1, 524319, 131074, 1, 458781, 65538, 1, 458782, 65538, 1, 458783, 131074, 1, 393245, 65538, 1, 393246, 65538, 1, 393247, 131074, 1, 327709, 65538, 0, 327710, 65538, 0, 327711, 131074, 0, 458780, 65538, 1, 393244, 65538, 1, 327708, 65538, 0, 458779, 65538, 1, 393243, 65538, 1, 327707, 65538, 0, 524316, 65538, 2, 524315, 65538, 2, 524314, 2, 2, 458778, 65538, 3, 393242, 65538, 1, 327706, 65538, 0, 458777, 65538, 2, 393241, 65538, 1, 327705, 65538, 0, 458776, 65538, 2, 393240, 65538, 1, 327704, 65538, 0, 458775, 65538, 2, 393239, 65538, 1, 327703, 65538, 0, 458774, 65538, 2, 393238, 65538, 1, 327702, 65538, 0, 458773, 65538, 2, 393237, 65538, 1, 327701, 65538, 0, 458772, 65538, 2, 393236, 65538, 1, 327700, 65538, 0, 458771, 65538, 2, 393235, 65538, 1, 327699, 65538, 0, 458770, 65538, 2, 393234, 65538, 1, 327698, 65538, 0, 458769, 65538, 2, 393233, 65538, 1, 327697, 65538, 0, 458768, 65538, 2, 393232, 65538, 1, 327696, 65538, 0, 458767, 65538, 2, 393231, 65538, 1, 327695, 65538, 0, 458766, 65538, 2, 393230, 65538, 1, 327694, 65538, 0, 458765, 65538, 2, 393229, 65538, 1, 327693, 65538, 0, 458764, 65538, 2, 393228, 65538, 1, 327692, 65538, 0, 327691, 65538, 0, 327690, 2, 0, 851994, 65538, 1, 851995, 131074, 1, 917531, 131074, 2, 917530, 65538, 2, 917529, 65538, 2, 851993, 65538, 1, 786457, 65538, 0, 786458, 65538, 0, 786459, 131074, 0, 917528, 2, 2, 851992, 2, 1, 786456, 2, 0, 983056, 65538, 1, 983057, 131074, 1, 1048593, 131074, 2, 1048592, 65538, 2, 1048591, 65538, 2, 983055, 65538, 1, 917519, 65538, 0, 917520, 65538, 0, 917521, 131074, 0, 1048590, 65538, 2, 983054, 65538, 1, 917518, 65538, 0, 1048589, 2, 2, 983053, 2, 1, 917517, 2, 0, 720916, 65538, 1, 720917, 131074, 1, 786453, 131074, 2, 786452, 65538, 2, 786451, 65538, 2, 720915, 65538, 1, 655379, 65538, 0, 655380, 65538, 0, 655381, 131074, 0, 786450, 2, 2, 720914, 2, 1, 655378, 2, 0)

[node name="Camera2D" type="Camera2D" parent="."]
position = Vector2(659, 406)
zoom = Vector2(2, 2)

[node name="Player1" type="Sprite2D" parent="."]
texture_filter = 1
position = Vector2(722, 494)
texture = ExtResource("7_fylca")

[node name="Button2" type="Button" parent="."]
offset_left = 715.0
offset_top = 535.0
offset_right = 947.0
offset_bottom = 579.0
theme_override_fonts/font = ExtResource("3_f6s8w")
theme_override_font_sizes/font_size = 45
text = "Spiel starten
"

[node name="Label" type="Label" parent="."]
offset_left = 420.0
offset_top = 228.0
offset_right = 1062.0
offset_bottom = 388.0
theme_override_colors/font_color = Color(0.596078, 0.478431, 0.933333, 1)
theme_override_constants/outline_size = 12
theme_override_fonts/font = ExtResource("3_f6s8w")
theme_override_font_sizes/font_size = 135
text = "ClaB Jump"

[node name="Door" type="Sprite2D" parent="."]
texture_filter = 1
position = Vector2(620, 302)
scale = Vector2(0.90625, 1)
texture = SubResource("AtlasTexture_xuis4")

[node name="Spike" type="Sprite2D" parent="."]
texture_filter = 1
position = Vector2(396, 544)
texture = ExtResource("6_osnhw")

[node name="Spike2" type="Sprite2D" parent="."]
texture_filter = 1
position = Vector2(641, 544)
texture = ExtResource("6_osnhw")

[node name="Spike3" type="Sprite2D" parent="."]
texture_filter = 1
position = Vector2(541, 448)
texture = ExtResource("6_osnhw")

[node name="Spike4" type="Sprite2D" parent="."]
texture_filter = 1
position = Vector2(927, 511)
texture = ExtResource("6_osnhw")

[node name="Key" type="Sprite2D" parent="."]
texture_filter = 1
position = Vector2(920, 487)
texture = ExtResource("7_v47uj")

[node name="Key2" type="Sprite2D" parent="."]
texture_filter = 1
position = Vector2(476, 448)
texture = ExtResource("7_v47uj")

[node name="Diamond" type="Sprite2D" parent="."]
texture_filter = 1
position = Vector2(841, 375)
scale = Vector2(0.25, 0.25)
texture = ExtResource("8_pfbvn")

[node name="Diamond2" type="Sprite2D" parent="."]
texture_filter = 1
position = Vector2(669, 318)
scale = Vector2(0.25, 0.25)
texture = ExtResource("8_pfbvn")

[connection signal="pressed" from="Button2" to="." method="_on_button_2_pressed"]
