; Engine configuration file.
; It's best edited using the editor UI and not directly,
; since the parameters that go here are not all obvious.
;
; Format:
;   [section] ; section goes between []
;   param=value ; assign values to parameters

config_version=5

[application]

config/name="ClaB Jump"
run/main_scene="res://start.tscn"
config/features=PackedStringArray("4.0", "Mobile")
config/icon="res://icon.svg"

[autoload]

GameLogic="*res://scripts/game_logic.gd"

[display]

window/size/viewport_width=1280
window/size/viewport_height=720
window/size/mode=3
window/stretch/mode="viewport"
window/dpi/allow_hidpi=false

[rendering]

renderer/rendering_method="mobile"
textures/vram_compression/import_etc2_astc=true
