[gd_scene load_steps=9 format=3 uid="uid://b444t0fvxb550"]

[ext_resource type="Script" path="res://scripts/level.gd" id="1_blhgc"]
[ext_resource type="TileSet" uid="uid://bxie0by0aiitg" path="res://tileset.tres" id="1_gsba0"]
[ext_resource type="FontFile" uid="uid://dvv5ud1ix5dji" path="res://images/m5x7.ttf" id="3_sxb6u"]
[ext_resource type="PackedScene" uid="uid://dpcfusduj6k1" path="res://player.tscn" id="4_wicl4"]
[ext_resource type="PackedScene" uid="uid://cr36ykib1ekmq" path="res://diamond.tscn" id="5_bair1"]
[ext_resource type="PackedScene" uid="uid://jn5bjboqwu5d" path="res://key.tscn" id="6_ijf71"]
[ext_resource type="PackedScene" uid="uid://bbrpwlpmu184b" path="res://door.tscn" id="7_bc4qn"]
[ext_resource type="PackedScene" uid="uid://b6xpnyorqfgy1" path="res://spike.tscn" id="8_pr5lg"]

[node name="level" type="Node2D"]
script = ExtResource("1_blhgc")

[node name="Camera2D" type="Camera2D" parent="."]
position = Vector2(640, 359)
zoom = Vector2(2, 2)

[node name="TileMap" type="TileMap" parent="."]
texture_filter = 1
tile_set = ExtResource("1_gsba0")
format = 2
layer_0/tile_data = PackedInt32Array(327689, 65538, 1, 327690, 131074, 1, 393226, 131074, 1, 393225, 65538, 1, 393224, 2, 1, 327688, 2, 1, 262152, 2, 0, 262153, 65538, 0, 262154, 131074, 0, 458761, 65538, 1, 458760, 2, 1, 524296, 2, 1, 589834, 131074, 1, 589833, 65538, 1, 589832, 2, 1, 655370, 2, 4, 655369, 65538, 1, 655368, 2, 1, 720906, 65538, 1, 720905, 65538, 1, 720904, 2, 1, 786442, 2, 3, 786441, 65538, 1, 786440, 2, 1, 851978, 131074, 1, 851977, 65538, 1, 851976, 2, 1, 917514, 131074, 1, 917513, 65538, 1, 917512, 2, 1, 983050, 2, 4, 983049, 65538, 1, 983048, 2, 1, 1048586, 65538, 1, 1048585, 65538, 1, 1048584, 2, 1, 1114122, 65538, 1, 1114121, 65538, 1, 1114120, 2, 1, 1179658, 65538, 2, 1179657, 65538, 2, 1179656, 2, 2, 1114123, 65538, 1, 1179659, 65538, 2, 1114124, 65538, 1, 1179660, 65538, 2, 1048588, 2, 4, 1114125, 65538, 1, 1179661, 65538, 2, 1048589, 65538, 0, 1114126, 65538, 1, 1179662, 65538, 2, 1048590, 65538, 0, 1114127, 65538, 1, 1179663, 65538, 2, 1048591, 65538, 0, 1114128, 65538, 1, 1179664, 65538, 2, 1048592, 65538, 4, 1114129, 65538, 1, 1179665, 65538, 2, 1114130, 65538, 1, 1179666, 65538, 2, 1048594, 2, 4, 1114131, 65538, 1, 1179667, 65538, 2, 1048595, 65538, 0, 1179668, 65538, 2, 1114133, 65538, 1, 1179669, 65538, 2, 1048597, 65538, 1, 1114134, 65538, 1, 1179670, 65538, 2, 1048598, 65538, 1, 1114135, 65538, 1, 1179671, 65538, 2, 1048599, 65538, 1, 1114136, 65538, 1, 1179672, 65538, 2, 1048600, 65538, 1, 1114137, 65538, 1, 1179673, 65538, 2, 1048601, 65538, 1, 1114138, 65538, 1, 1179674, 65538, 2, 1048602, 65538, 1, 1114139, 65538, 1, 1179675, 65538, 2, 1048603, 2, 4, 1114140, 65538, 1, 1179676, 65538, 2, 1048604, 65538, 0, 1114141, 65538, 1, 1179677, 65538, 2, 1048605, 65538, 4, 1114142, 65538, 1, 1179678, 65538, 2, 1048606, 65538, 1, 1114143, 131074, 1, 1179679, 131074, 2, 1048607, 131074, 1, 983069, 2, 1, 983070, 65538, 1, 983071, 131074, 1, 917533, 2, 1, 917534, 65538, 1, 917535, 131074, 1, 851997, 2, 1, 851998, 65538, 1, 851999, 131074, 1, 786461, 2, 1, 786462, 65538, 1, 786463, 131074, 1, 720926, 65538, 1, 720927, 131074, 1, 655390, 65538, 1, 655391, 131074, 1, 589854, 65538, 1, 524318, 65538, 1, 458782, 65538, 1, 393246, 65538, 1, 327710, 65538, 1, 393247, 131074, 1, 458783, 131074, 1, 327711, 131074, 1, 262173, 65538, 0, 262174, 65538, 0, 262175, 131074, 0, 524319, 131074, 1, 589855, 131074, 1, 327709, 65538, 1, 393245, 65538, 3, 458781, 2, 1, 524317, 2, 1, 589853, 2, 1, 655389, 2, 1, 720925, 2, 1, 393244, 65538, 2, 327708, 65538, 1, 262172, 65538, 0, 393243, 65538, 2, 327707, 65538, 1, 262171, 65538, 0, 393242, 65538, 2, 327706, 65538, 1, 262170, 65538, 0, 393241, 65538, 2, 327705, 65538, 1, 262169, 65538, 0, 393240, 65538, 2, 327704, 65538, 1, 262168, 65538, 0, 393239, 65538, 2, 327703, 65538, 1, 262167, 65538, 0, 393238, 65538, 2, 327702, 65538, 1, 262166, 65538, 0, 393237, 65538, 2, 327701, 65538, 1, 262165, 65538, 0, 393236, 65538, 2, 327700, 65538, 1, 262164, 65538, 0, 393235, 65538, 2, 327699, 65538, 1, 262163, 65538, 0, 393234, 65538, 2, 327698, 65538, 1, 262162, 65538, 0, 393233, 65538, 2, 327697, 65538, 1, 262161, 65538, 0, 393232, 2, 2, 327696, 2, 1, 262160, 2, 0, 458762, 131074, 1, 1048587, 65538, 1, 1048593, 65538, 1, 720907, 65538, 1, 786443, 65538, 2, 655371, 65538, 0, 720908, 65538, 1, 786444, 65538, 2, 655372, 65538, 0, 720909, 65538, 1, 786445, 65538, 2, 655373, 65538, 0, 720910, 65538, 1, 786446, 65538, 2, 655374, 65538, 0, 720911, 65538, 1, 786447, 65538, 2, 655375, 65538, 0, 720912, 65538, 1, 786448, 65538, 2, 655376, 65538, 0, 720913, 65538, 1, 786449, 65538, 2, 655377, 65538, 0, 720914, 65538, 1, 720915, 131074, 1, 786451, 131074, 2, 786450, 65538, 2, 655378, 65538, 0, 655379, 131074, 0, 589845, 65538, 1, 589846, 65538, 1, 655382, 65538, 2, 655381, 65538, 2, 655380, 2, 2, 589844, 2, 1, 524308, 2, 0, 524309, 65538, 0, 524310, 65538, 0, 589847, 65538, 1, 589848, 131074, 1, 655384, 131074, 2, 655383, 65538, 2, 524311, 65538, 0, 524312, 131074, 0, 720922, 65538, 1, 720923, 131074, 1, 786459, 131074, 2, 786458, 65538, 2, 786457, 2, 2, 720921, 2, 1, 655385, 2, 0, 655386, 65538, 0, 655387, 131074, 0, 983061, 65538, 1, 983062, 2, 4, 983060, 2, 1, 917524, 2, 0, 917525, 65538, 0, 917526, 131074, 0, 983063, 65538, 0, 983064, 65538, 0, 983065, 65538, 4, 983066, 65538, 1, 983067, 131074, 1, 917529, 2, 0, 917530, 65538, 0, 917531, 131074, 0, 983056, 2, 0, 983057, 65538, 0, 983058, 131074, 0, 983051, 65538, 0, 983052, 131074, 0, 524297, 65538, 1, 524298, 131074, 1, 1114132, 65538, 1, 1048596, 65538, 4)

[node name="CanvasLayer" type="CanvasLayer" parent="."]

[node name="Label2" type="Label" parent="CanvasLayer"]
offset_left = 47.0
offset_top = 35.0
offset_right = 185.0
offset_bottom = 72.0
theme_override_colors/font_color = Color(0.898039, 0.937255, 0.513726, 1)
theme_override_fonts/font = ExtResource("3_sxb6u")
theme_override_font_sizes/font_size = 42
text = "Coins: 123"

[node name="Label" type="Label" parent="CanvasLayer"]
offset_left = 1095.0
offset_top = 35.0
offset_right = 1246.0
offset_bottom = 72.0
theme_override_colors/font_color = Color(0.898039, 0.937255, 0.513726, 1)
theme_override_fonts/font = ExtResource("3_sxb6u")
theme_override_font_sizes/font_size = 42
text = "Keys: 0 / 3"

[node name="player" parent="." instance=ExtResource("4_wicl4")]
position = Vector2(421, 186)

[node name="diamond" parent="." instance=ExtResource("5_bair1")]
position = Vector2(372, 461)

[node name="diamond2" parent="." instance=ExtResource("5_bair1")]
position = Vector2(634, 505)

[node name="key" parent="." instance=ExtResource("6_ijf71")]
position = Vector2(431, 515)

[node name="key2" parent="." instance=ExtResource("6_ijf71")]
position = Vector2(850, 312)

[node name="door" parent="." instance=ExtResource("7_bc4qn")]
position = Vector2(912, 493)

[node name="spike" parent="." instance=ExtResource("8_pr5lg")]
position = Vector2(862, 404)
rotation = 3.14159

[node name="spike2" parent="." instance=ExtResource("8_pr5lg")]
position = Vector2(820, 457)
rotation = -0.261799
scale = Vector2(0.75, 0.75)
skew = -0.261799

[node name="spike3" parent="." instance=ExtResource("8_pr5lg")]
position = Vector2(474, 512)
