{
	"_id" : "64a76580fc37f3d3d930cf64",
	"firstName" : "James",
	"lastName" : "Dean",
	"email" : "jamesdean@mail.com",
	"password" : "james1234",
	"isAdmin" : false,
	"mobileNumber" : "09123456789",
	"enrollment" : ["64ab4f96be38c98ad260a7fb"],
	"dateTimeRegistered": "2023-07-26T11:57:00Z"
}