%YAML 1.1
%TAG !u! tag:unity3d.com,2011:
--- !u!221 &22100000
AnimatorOverrideController:
  m_ObjectHideFlags: 0
  m_CorrespondingSourceObject: {fileID: 0}
  m_PrefabInstance: {fileID: 0}
  m_PrefabAsset: {fileID: 0}
  m_Name: TitleCardAnimator
  m_Controller: {fileID: 9100000, guid: c7094dedc2a922b40a96915e188e3a86, type: 2}
  m_Clips:
  - m_OriginalClip: {fileID: 7400000, guid: 326294102afbcb14299fadbfdecc554f, type: 2}
    m_OverrideClip: {fileID: 7400000, guid: 326294102afbcb14299fadbfdecc554f, type: 2}
  - m_OriginalClip: {fileID: 7400000, guid: fa984b47dcf968a4dbad40efef19664d, type: 2}
    m_OverrideClip: {fileID: 7400000, guid: fa984b47dcf968a4dbad40efef19664d, type: 2}
  - m_OriginalClip: {fileID: 7400000, guid: 44b8325ec3901a942a6570d52ca56d95, type: 2}
    m_OverrideClip: {fileID: 7400000, guid: 44b8325ec3901a942a6570d52ca56d95, type: 2}
  - m_OriginalClip: {fileID: 7400000, guid: 233684bb597d7614dada66d757fbc41c, type: 2}
    m_OverrideClip: {fileID: 7400000, guid: 233684bb597d7614dada66d757fbc41c, type: 2}
