{
        "depends_on": [
            2281690
        ],
        "cf_clone_of": null,
        "product": "Security Response",
        "assigned_to_detail": {
            "insider": false,
            "name": "prodsec-ir-bot@bot.bugzilla.redhat.com",
            "active": true,
            "email": "prodsec-ir-bot@bot.bugzilla.redhat.com",
            "real_name": "Product Security",
            "partner": false,
            "id": 488104
        },
        "summary": "CVE-1999-12345 kernel: this is a simple security flaw",
        "severity": "medium",
        "external_bugs": [
            {
                "ext_bz_id": 139,
                "ext_priority": "None",
                "id": 2326151,
                "ext_status": "None",
                "bug_id": 2226889,
                "ext_description": "None",
                "ext_bz_bug_id": "RHBA-1999:1234",
                "is_migration_link": 0,
                "type": {
                    "type": "None",
                    "can_send": 0,
                    "full_url": "https://access.redhat.com/errata/%id%",
                    "url": "https://access.redhat.com/errata/",
                    "can_get": 0,
                    "must_send": 0,
                    "description": "Red Hat Product Errata",
                    "id": 139,
                    "send_once": 0
                }
            },
            {
                "ext_bz_id": 139,
                "ext_priority": "None",
                "id": 2324680,
                "ext_status": "None",
                "bug_id": 2226889,
                "ext_description": "None",
                "ext_bz_bug_id": "RHSA-2024:4211",
                "is_migration_link": 0,
                "type": {
                    "can_send": 0,
                    "type": "None",
                    "full_url": "https://access.redhat.com/errata/%id%",
                    "can_get": 0,
                    "url": "https://access.redhat.com/errata/",
                    "must_send": 0,
                    "description": "Red Hat Product Errata",
                    "id": 139,
                    "send_once": 0
                }
            },
            {
                "type": {
                    "must_send": 0,
                    "description": "Red Hat Product Errata",
                    "id": 139,
                    "send_once": 0,
                    "full_url": "https://access.redhat.com/errata/%id%",
                    "can_get": 0,
                    "url": "https://access.redhat.com/errata/",
                    "can_send": 0,
                    "type": "None"
                },
                "is_migration_link": 0,
                "ext_bz_bug_id": "RHSA-2024:4352",
                "ext_description": "None",
                "bug_id": 2226889,
                "id": 2325179,
                "ext_status": "None",
                "ext_priority": "None",
                "ext_bz_id": 139
            }
        ],
        "resolution": "",
        "assigned_to": "prodsec-ir-bot@bot.bugzilla.redhat.com",
        "pool": {},
        "blocks": [
            2211234
        ],
        "status": "NEW",
        "cf_fixed_in": "kernel 5.15.154, kernel 6.1.85, kernel 6.6.26, kernel 6.8.5, kernel 6.9",
        "dupe_of": null,
        "data_category": "Public",
        "priority": "medium",
        "component": [
            "vulnerability"
        ],
        "id": 2226889,
        "keywords": [
            "Security"
        ],
        "alias": [
            "CVE-1999-12345"
        ],
        "creation_time": "2024-05-20T11:48:34Z",
        "cf_devel_whiteboard": "(DO NOT MODIFY THIS FIELD MANUALLY; YOUR CHANGES WILL BE OVERWRITTEN ON NEXT UPDATE.)\r\n\r\nREFERENCES\r\n----------\r\n\r\nhttps://lore.kernel.org/linux-cve-announce/2024051948-CVE-1999-12345-beaa@gregkh/T",
        "flags": [
            {
                "type_id": 415,
                "creation_date": "2024-05-20T11:48:34Z",
                "name": "requires_doc_text",
                "modification_date": "2024-12-04T22:18:29Z",
                "id": 6119914,
                "is_active": 1,
                "setter": "bzimport@bot.bugzilla.redhat.com",
                "status": "?"
            }
        ],
        "stream": ""
}
