% This LilyPond file was generated by Rosegarden 1.5.1

\version "2.10.0"
% point and click debugging is disabled
#(ly:set-option 'point-and-click #f)
\header {
	title = "Ven, libertador"
	tagline = "Coro Juvenil San Juan Bosco"
	instrument = "Bajo + guía"
}
#(set-global-staff-size 20)
#(set-default-paper-size "letter")
\paper {
	#(define line-width (* 7 in))
	print-first-page-number = ##t
	ragged-bottom = ##t
	first-page-number = 1
}
global = {
	\time 2/4
}
globalTempo = {
	\tempo 4 = 100
}

\include "venlibertador-bajo.def"

\score {
	\new StaffGroup <<
		\override Score.NoteColumn #'force-hshift = #1.0

		\include "venlibertador-acordes.inc"
		\include "venlibertador-guia.inc"
		\include "venlibertador-bajo.inc"
	>>

	\layout {
		\context {
			\Voice \remove New_fingering_engraver
		}

	}
}
