% This LilyPond file was generated by Rosegarden 1.5.1
\include "nederlands.ly"
\version "2.10.0"
% point and click debugging is disabled
#(ly:set-option 'point-and-click #f)
\header {
	title = "Ven, Espíritu divino"
	tagline = "Coro Juvenil San Juan Bosco"
}
#(set-global-staff-size 20)
#(set-default-paper-size "letter")
\paper {
	#(define line-width (* 7 in))
	print-first-page-number = ##t
	ragged-bottom = ##t
	first-page-number = 1
}
global = {
	\time 4/4 \skip 1*13
	\time 2/4 \skip 2
	\time 4/4 \skip 1*12
	\time 2/4 \skip 2
	\time 4/4 \skip 1*12
	\time 2/4 \skip 2
	\time 4/4 \skip 1*12
	\time 2/4 \skip 2
	\time 4/4 \skip 1*12
	\time 2/4 \skip 2
	\time 4/4
}
globalTempo = {
	\tempo 4 = 75
}
\score {
	<<
		% force offset of colliding notes in chords:
		\override Score.NoteColumn #'force-hshift = #1.0

		\include "venespiritudivino-acordes.inc"
		\new StaffGroup <<
			\include "venespiritudivino-soprano.inc"
			\include "venespiritudivino-mezzo.inc"
			\include "venespiritudivino-tenor.inc"
		>>
	>>

	\layout {
		\context {
			\RemoveEmptyStaffContext
		}
		\context { \ChordNames \consists Instrument_name_engraver }
	}
}
