% This LilyPond file was generated by Rosegarden 13.04
\version "2.12.0"
\include "nederlands.ly"
% point and click debugging is disabled
#(ly:set-option 'point-and-click #f)
\header {
	title = "Somos del Señor"
	tagline = "Coro Juvenil San Juan Bosco"
	instrument = "Mezzosoprano"
}
#(set-global-staff-size 20)
#(set-default-paper-size "letter")
\paper {
	#(define line-width (* 7 in))
	print-first-page-number = ##t
	ragged-bottom = ##t
	first-page-number = 1
}
global = {
	\time 4/4
}
globalTempo = {
	\tempo 4 = 100
}

\score {
	<<
	% force offset of colliding notes in chords:
	\override Score.NoteColumn #'force-hshift = #1.0

		\include "somosdelsennor-acordes.inc"
		\include "somosdelsennor-mezzo.inc"
	>>

	\layout { }
}
