% This LilyPond file was generated by Rosegarden 1.7.3
\version "2.10.0"
% point and click debugging is disabled
#(ly:set-option 'point-and-click #f)
\header {
	title = "Si conocieras"
	tagline = "Coro Juvenil San Juan Bosco"
	instrument = "Bajo"
}
#(set-global-staff-size 20)
#(set-default-paper-size "letter")
\paper {
	#(define line-width (* 7 in))
	print-first-page-number = ##t
	ragged-bottom = ##t
	first-page-number = 1
}
global = {
	\time 4/4
}
globalTempo = {
	\tempo 4 = 74
}

\include "siconocieras-bajo.def"

\score {
	\new StaffGroup <<
		\override Score.NoteColumn #'force-hshift = #1.0

		\include "siconocieras-acordes.inc"
		\include "siconocieras-soprano.inc"
		\include "siconocieras-bajo.inc"
	>>

	\layout {
		\context {
			\Staff
				\remove "New_fingering_engraver"
		}
	}
}
