% This LilyPond file was generated by Rosegarden 1.5.1
\include "nederlands.ly"
\version "2.10.0"
% point and click debugging is disabled
#(ly:set-option 'point-and-click #f)
\header {
	title = "Nada te turbe"
	poet = "Santa Teresa de Jesús"
	composer = "Michael Keating"
	instrument = "Tenor"
	tagline = "Coro Juvenil San Juan Bosco"
}
#(set-global-staff-size 20)
#(set-default-paper-size "letter")
\paper {
	#(define line-width (* 7 in))
	print-first-page-number = ##t
	ragged-bottom = ##t
	first-page-number = 1
}
global = {
	\time 4/4
}
globalTempo = {
	\tempo 4 = 90
}
\include "nadateturbe-acordes.def"
\score {
	<<

		% force offset of colliding notes in chords:
		\override Score.NoteColumn #'force-hshift = #1.0

		\include "nadateturbe-acordes.inc"
		\include "nadateturbe-acordes-do.inc"
		\include "nadateturbe-tenor.inc"

	>>

	\layout {
		\context { \RemoveEmptyStaffContext }
		\context { \ChordNames \consists Instrument_name_engraver }
	}
}
