% This LilyPond file was generated by Rosegarden 1.5.1

\version "2.10.0"
% point and click debugging is disabled
#(ly:set-option 'point-and-click #f)
\header {
	title = "Mi corazón, mi mente"
	tagline = "Coro Juvenil San Juan Bosco"
	instrument = "Bajo"
}
#(set-global-staff-size 20)
#(set-default-paper-size "letter")
\paper {
	#(define line-width (* 7 in))
	print-first-page-number = ##t
	ragged-bottom = ##t
	first-page-number = 1
}
global = {
	\time 4/4
}
globalTempo = {
	\tempo 4 = 70
}

\include "micorazonmimente-bajo.def"

\score {
	\new StaffGroup <<
		\override Score.NoteColumn #'force-hshift = #1.0

		\include "micorazonmimente-acordes.inc"
		%\include "micorazonmimente-soprano.inc"
		\include "micorazonmimente-bajo5.inc"
	>>

	\layout {
		\context {
			\Voice \remove New_fingering_engraver
		}
	}
}
