% This LilyPond file was generated by Rosegarden 1.7.3
\version "2.10.0"
% point and click debugging is disabled
#(ly:set-option 'point-and-click #f)

\include "mandaelfuego.def"

\header {
	title = "Manda el fuego"
	composer = "George Misulia"
	poet = "Tr. Rafael Salazar / Rebeca de Salazar"
	tagline = "Coro Juvenil San Juan Bosco"
}
#(set-global-staff-size 20)
#(set-default-paper-size "letter")
\paper {
	#(define line-width (* 7 in))
	print-first-page-number = ##t
	ragged-bottom = ##t
	first-page-number = 1
}
global = {
	\time 4/4
	\skip 1*31
}
globalTempo = {
	\tempo 4 = 122  \skip 1*31
}
\score {
	<<
		% force offset of colliding notes in chords:
		\override Score.NoteColumn #'force-hshift = #1.0

		\include "mandaelfuego-acordes.inc"
		\new StaffGroup <<
			\include "mandaelfuego-soprano.inc"
			\include "mandaelfuego-mezzo.inc"
			\include "mandaelfuego-tenor.inc"
		>>
		\include "mandaelfuego-violin.inc"

	>>

	\layout {
		\context {
			%\RemoveEmptyStaffContext
		}
		\context { \ChordNames \consists Instrument_name_engraver }
	}
}
