% This LilyPond file was generated by Rosegarden 1.7.3
\version "2.10.0"
% point and click debugging is disabled
#(ly:set-option 'point-and-click #f)
\header {
	title = "Junto a ti, María"
	tagline = "Coro Juvenil San Juan Bosco"
}
#(set-global-staff-size 20)
#(set-default-paper-size "letter")
\paper {
	#(define line-width (* 7 in))
	print-first-page-number = ##t
	ragged-bottom = ##t
	first-page-number = 1
}
global = {
	\time 2/2
}
globalTempo = {
	\tempo 2 = 66
}
\score {
	<<
		% force offset of colliding notes in chords:
		\override Score.NoteColumn #'force-hshift = #1.0

		\include "juntoatimaria-acordes.inc"
		\new StaffGroup <<
			\include "juntoatimaria-soprano.inc"
			\include "juntoatimaria-mezzo.inc"
			\include "juntoatimaria-tenor.inc"
		>>
		%\include "juntoatimaria-violin.inc"
	>>

	\layout {
		\context {
			\RemoveEmptyStaffContext
		}
	}
}
