% This LilyPond file was generated by Rosegarden 1.7.3
\version "2.10.0"
% point and click debugging is disabled
#(ly:set-option 'point-and-click #f)

\header {
	title = "Jesús vive"
	tagline = "Coro Juvenil San Juan Bosco"
	instrument = "Mezzosoprano"
}
#(set-global-staff-size 20)
#(set-default-paper-size "letter")
\paper {
	#(define line-width (* 7 in))
	print-first-page-number = ##t
	ragged-bottom = ##t
	first-page-number = 1
}
global = {
	\time 2/2 \skip 1*19
	\time 4/4 \skip 1*18
	\time 2/2 \skip 1*19
	\time 4/4 \skip 1*18
	\time 2/2 \skip 1*19
	\time 4/4
}
globalTempo = {
	\tempo 2 = 67  \skip 1*19
	\tempo 4 = 134 \skip 1*18
	\tempo 2 = 67  \skip 1*19
	\tempo 4 = 134 \skip 1*18
	\tempo 2 = 67  \skip 1*19
	\tempo 4 = 134
}
\score {
	<<
		% force offset of colliding notes in chords:
		\override Score.NoteColumn #'force-hshift = #1.0

		\include "jesusvive-acordes.inc"
		\include "jesusvive-mezzo.inc"

	>>

	\layout {
		\context {
			%\RemoveEmptyStaffContext
		}
	}
}
