% This LilyPond file was generated by Rosegarden 1.5.1
\version "2.10.0"
% point and click debugging is disabled
#(ly:set-option 'point-and-click #f)
\header {
	composer = "Romeo Alfonso Valdés Villarreal"
	copyright = "Copyright © 1972 Romeo Alfonso Valdés Villarreal"
	title = "Gracias damos"
	instrument = "Mezzosoprano"
	tagline = "Coro Juvenil San Juan Bosco"
}
#(set-global-staff-size 20)
#(set-default-paper-size "letter")
\paper {
	#(define line-width (* 7 in))
	print-first-page-number = ##t
	ragged-bottom = ##t
	first-page-number = 1
}
global = {
	\partial 4*1
	\time 4/4
}
globalTempo = {
	\tempo 4 = 105
}
\score {
	<<
		% force offset of colliding notes in chords:
		\override Score.NoteColumn #'force-hshift = #1.0

		\include "graciasdamos-acordes.inc"
		\new StaffGroup <<
			%\include "graciasdamos-soprano.inc"
			\include "graciasdamos-mezzo.inc"
			%\include "graciasdamos-tenor.inc"
		>>
	>>

	\layout {
		\context { \RemoveEmptyStaffContext }
		\context { \ChordNames \consists Instrument_name_engraver }
	}
}
