% This LilyPond file was generated by Rosegarden 1.7.3
\version "2.10.0"
% point and click debugging is disabled
#(ly:set-option 'point-and-click #f)
\header {
	title = "Gloria a Dios en el cielo"
	subtitle = "Misa Nuestra Señora del Rosario"
	composer = "Sergio Armando Torres Gómez"
	copyright = "Copyright © Sergio Armando Torres Gómez"
	tagline = "Coro Juvenil San Juan Bosco"
}
#(set-global-staff-size 20)
#(set-default-paper-size "letter")
\paper {
	#(define line-width (* 7 in))
	print-first-page-number = ##t
	ragged-bottom = ##t
	first-page-number = 1
}
global = {
	\time 4/4
	\skip 4*56
}
globalTempo = {
	\tempo 4 = 112
	\skip 4*56
}
\score {
	<<
		% force offset of colliding notes in chords:
		\override Score.NoteColumn #'force-hshift = #1.0

		\include "gloriaadiosenelcielo-acordes.inc"
		\new StaffGroup <<
			\include "gloriaadiosenelcielo-soprano.inc"
			%\include "gloriaadiosenelcielo-mezzo.inc"
			%\include "gloriaadiosenelcielo-tenor.inc"
		>>

	>>
}
