% This LilyPond file was generated by Rosegarden 1.5.1
\include "nederlands.ly"
\version "2.10.0"
% point and click debugging is disabled
#(ly:set-option 'point-and-click #f)
\header {
	title = "El león de la tribu de Judá"
	tagline = "Coro Juvenil San Juan Bosco"
	composer = "Wendell Smith"
	copyright = "Copyright © 1983 Classic Fox Records"
}
#(set-global-staff-size 20)
#(set-default-paper-size "letter")
\paper {
	#(define line-width (* 7 in))
	print-first-page-number = ##t
	ragged-bottom = ##t
	first-page-number = 1
}
global = {
	\time 4/4
}
globalTempo = {
	\tempo 4 = 146
}
\score {
	<<
		% force offset of colliding notes in chords:
		\override Score.NoteColumn #'force-hshift = #1.0

		\include "elleondelatribu-acordes.inc"
		\new StaffGroup <<
			\include "elleondelatribu-soprano.inc"
			\include "elleondelatribu-mezzo.inc"
			\include "elleondelatribu-tenor.inc"
			\include "elleondelatribu-baritono.inc"
		>>
		%\include "elleondelatribu-violin.inc"

	>>

	\layout {
		\context {
			\RemoveEmptyStaffContext
		}
		\context { \ChordNames \consists Instrument_name_engraver }
	}
}
