% This LilyPond file was generated by Rosegarden 1.5.1
\version "2.10.0"
% point and click debugging is disabled
#(ly:set-option 'point-and-click #f)

\include "conelvinoyconelpan.def"

\header {
	title = "Con el vino y con el pan"
	instrument = "Soprano"
	tagline = "Coro Juvenil San Juan Bosco"
}
#(set-global-staff-size 20)
#(set-default-paper-size "letter")
\paper {
	#(define line-width (* 7 in))
	print-first-page-number = ##t
	ragged-bottom = ##t
	first-page-number = 1
}
global = {
	\time 6/8
}
globalTempo = {
	\tempo 4. = 64
}
\score {
	<<
		% force offset of colliding notes in chords:
		\override Score.NoteColumn #'force-hshift = #1.0

		\include "conelvinoyconelpan-acordes.inc"
		\new StaffGroup <<
			\include "conelvinoyconelpan-soprano.inc"
			%\include "conelvinoyconelpan-mezzo.inc"
			%\include "conelvinoyconelpan-tenor.inc"
		>>
	>>

	\layout {
		\context { \RemoveEmptyStaffContext }
		\context { \ChordNames \consists Instrument_name_engraver }
	}
}
