% This LilyPond file was generated by Rosegarden 1.5.1
\version "2.10.0"
% point and click debugging is disabled
#(ly:set-option 'point-and-click #f)

\include "aleluyakarim.def"

\header {
	title = "Aleluya"
	subtitle = "Navideño"
	composer = "Karim Herrera"
	instrument = "Tenor"
	tagline = "Coro Juvenil San Juan Bosco"
}
#(set-global-staff-size 20)
#(set-default-paper-size "letter")
\paper {
	#(define line-width (* 7 in))
	print-first-page-number = ##t
	ragged-bottom = ##t
	first-page-number = 1
}
global = {
	\time 2/4
}
globalTempo = {
	\tempo 4 = 110
}
\score {
	<<
		% force offset of colliding notes in chords:
		\override Score.NoteColumn #'force-hshift = #1.0

		\include "aleluyakarim-acordes.inc"
		\include "aleluyakarim-marcas.inc"
		\new StaffGroup <<
			%\include "aleluyakarim-soprano.inc"
			%\include "aleluyakarim-mezzo.inc"
			\include "aleluyakarim-tenor.inc"
		>>
		%\include "aleluyakarim-violin.inc"

	>>

	\layout {
		\context { \RemoveEmptyStaffContext }
		\context { \ChordNames \consists Instrument_name_engraver }
	}
}
