{
    "mappers": [
        {
            "name": "Tenant-mapper Names",
            "fileName": "/theme/ocp-custom/login/resources/js/tenantnames.js",
            "description": "Client-check mapper"
        },
        {
            "name": "Tenant-mapper Group-Roles",
            "fileName": "/theme/ocp-custom/login/resources/js/tenantgrouproles.js",
            "description": "Client-check mapper"
        },
        {
            "name": "Tenant-mapper Service",
            "fileName": "/theme/ocp-custom/login/resources/js/service.js",
            "description": "Client-check mapper"
        },
        {
            "name": "Tenant-mapper Client-check",
            "fileName": "/theme/ocp-custom/login/resources/js/clientcheck.js",
            "description": "Client-check mapper"
        },
        {
            "name": "CKAN Org Roles Mapper",
            "fileName": "/theme/ocp-custom/login/resources/js/ckanorgroles.js",
            "description": "ckan-orgroles mapper"
        }
    ]
}