{
  "uri": "{{ api_path }}*",
  "name": "{{ api_portal_name }} Write",
  "desc": "{{ api_portal_description }}",
  "methods": [
    "POST",
    "PUT",
    "PATCH"
  ],
  "plugins": {
    "prometheus": {
      "_meta": {
        "disable": false
      },
      "prefer_name": true
    },
    "loki-logger": {
      "batch_max_size": 1000,
      "buffer_duration": 60,
      "endpoint_addrs": [
        "http://loki.{{ general_api_management_settings.plugins.loki_logger.ns }}:3100"
      ],
      "endpoint_uri": "/loki/api/v1/push",
      "inactive_timeout": 5,
      "include_req_body": true,
      "include_resp_body": true,
      "keepalive": true,
      "keepalive_pool": 5,
      "keepalive_timeout": 60000,
      "log_labels": {
        "job": "{{ general_api_management_settings.plugins.loki_logger.job_label }}",
        "upstream": "{{ api_management_settings.frost.api_loki_logger_label }}",
        "route": "{{ api_management_settings.frost.api_loki_logger_label}}_write"
      },
      "max_retry_count": 0,
      "name": "loki logger",
      "retry_delay": 1,
      "ssl_verify": false,
      "tenant_id": "fake",
      "timeout": 3000
    },
    "openid-connect": {
      "_meta": {
        "disable": false
      },
      "bearer_only": true,
      "client_id": "{{ IDM_CLIENT.API_ACCESS }}",
      "client_secret": "{{ api_access_client_secret }}",
      "discovery": "https://idm.{{ DOMAIN }}/realms/{{ inv_access.keycloak.realm_name }}/.well-known/openid-configuration",
      "introspection_endpoint": "https://idm.{{ DOMAIN }}/realms/{{ inv_access.keycloak.realm_name }}/protocol/openid-connect/token/introspect",
      "introspection_endpoint_auth_method": "post",
      "realm": "{{ inv_access.keycloak.realm_name }}",
      "required_scopes": [
        "api:write"
      ]
    },
    "response-rewrite": {
      "_meta": {
        "disable": false
      },
      "body_base64": false,
      "filters": [
        {
          "options": "jo",
          "regex": "http://frost-server:",
          "replace": "https://api.{{ DOMAIN }}",
          "scope": "global"
        }
      ],
      "vars": []
    },
    "proxy-rewrite": {
      "regex_uri": [
        "^{{ api_path }}(.*)",
        "{{ api_rewrite_path }}/$1"
      ]
    }
  },
  "upstream_id": "{{ upstream_id }}",
  "status": 1
}