<?xml version="1.0" standalone="no"?>
<!DOCTYPE svg PUBLIC "-//W3C//DTD SVG 20010904//EN"
 "http://www.w3.org/TR/2001/REC-SVG-20010904/DTD/svg10.dtd">
<svg version="1.0" xmlns="http://www.w3.org/2000/svg"
 width="700.000000pt" height="700.000000pt" viewBox="0 0 700.000000 700.000000"
 preserveAspectRatio="xMidYMid meet">
<metadata>
Created by potrace 1.14, written by Peter Selinger 2001-2017
</metadata>
<g transform="translate(0.000000,700.000000) scale(0.100000,-0.100000)"
fill="#000000" stroke="none">
<path d="M3285 6263 c-1241 -105 -2257 -1006 -2499 -2213 -44 -219 -51 -294
-51 -550 0 -256 7 -331 51 -550 166 -832 712 -1544 1474 -1924 244 -122 441
-190 693 -241 1017 -206 2067 178 2714 992 226 283 406 635 499 973 240 869
54 1785 -504 2480 -533 665 -1337 1047 -2182 1038 -85 -1 -173 -3 -195 -5z"/>
</g>
</svg>
