{
  "$schema": "http://json-schema.org/draft-04/schema#",
  "type": "object",
  "properties": {
    "RELI": {
      "type": "integer"
    },
    "ERHJAHR": {
      "type": "integer"
    },
    "E_KOORD": {
      "type": "integer"
    },
    "N_KOORD": {
      "type": "integer"
    },
    "BTOT": {
      "type": "integer"
    },
    "B11": {
      "type": "integer"
    },
    "B12": {
      "type": "integer"
    },
    "B13": {
      "type": "integer"
    },
    "B14": {
      "type": "integer"
    },
    "B15": {
      "type": "integer"
    },
    "B16": {
      "type": "integer"
    },
    "B21": {
      "type": "integer"
    },
    "B22": {
      "type": "integer"
    },
    "B23": {
      "type": "integer"
    },
    "B24": {
      "type": "integer"
    },
    "B25": {
      "type": "integer"
    },
    "B26": {
      "type": "integer"
    },
    "B27": {
      "type": "integer"
    },
    "B28": {
      "type": "integer"
    },
    "B29": {
      "type": "integer"
    },
    "B30": {
      "type": "integer"
    },
    "BMTOT": {
      "type": "integer"
    },
    "BM01": {
      "type": "integer"
    },
    "BM02": {
      "type": "integer"
    },
    "BM03": {
      "type": "integer"
    },
    "BM04": {
      "type": "integer"
    },
    "BM05": {
      "type": "integer"
    },
    "BM06": {
      "type": "integer"
    },
    "BM07": {
      "type": "integer"
    },
    "BM08": {
      "type": "integer"
    },
    "BM09": {
      "type": "integer"
    },
    "BM10": {
      "type": "integer"
    },
    "BM11": {
      "type": "integer"
    },
    "BM12": {
      "type": "integer"
    },
    "BM13": {
      "type": "integer"
    },
    "BM14": {
      "type": "integer"
    },
    "BM15": {
      "type": "integer"
    },
    "BM16": {
      "type": "integer"
    },
    "BM17": {
      "type": "integer"
    },
    "BM18": {
      "type": "integer"
    },
    "BM19": {
      "type": "integer"
    },
    "BWTOT": {
      "type": "integer"
    },
    "BW01": {
      "type": "integer"
    },
    "BW02": {
      "type": "integer"
    },
    "BW03": {
      "type": "integer"
    },
    "BW04": {
      "type": "integer"
    },
    "BW05": {
      "type": "integer"
    },
    "BW06": {
      "type": "integer"
    },
    "BW07": {
      "type": "integer"
    },
    "BW08": {
      "type": "integer"
    },
    "BW09": {
      "type": "integer"
    },
    "BW10": {
      "type": "integer"
    },
    "BW11": {
      "type": "integer"
    },
    "BW12": {
      "type": "integer"
    },
    "BW13": {
      "type": "integer"
    },
    "BW14": {
      "type": "integer"
    },
    "BW15": {
      "type": "integer"
    },
    "BW16": {
      "type": "integer"
    },
    "BW17": {
      "type": "integer"
    },
    "BW18": {
      "type": "integer"
    },
    "BW19": {
      "type": "integer"
    },
    "B41": {
      "type": "integer"
    },
    "B42": {
      "type": "integer"
    },
    "B43": {
      "type": "integer"
    },
    "B44": {
      "type": "integer"
    },
    "B45": {
      "type": "integer"
    },
    "B46": {
      "type": "integer"
    },
    "B51": {
      "type": "integer"
    },
    "B52": {
      "type": "integer"
    },
    "B53": {
      "type": "integer"
    },
    "B54": {
      "type": "integer"
    },
    "B55": {
      "type": "integer"
    },
    "B56": {
      "type": "integer"
    },
    "PTOT": {
      "type": "integer"
    },
    "P01": {
      "type": "integer"
    },
    "P02": {
      "type": "integer"
    },
    "P03": {
      "type": "integer"
    },
    "P04": {
      "type": "integer"
    },
    "P05": {
      "type": "integer"
    },
    "P06": {
      "type": "integer"
    },
    "PI": {
      "type": "integer"
    }
  }
}