<?xml version="1.0" encoding="UTF-8" standalone="no"?>
<!DOCTYPE svg PUBLIC "-//W3C//DTD SVG 1.1//EN" "http://www.w3.org/Graphics/SVG/1.1/DTD/svg11.dtd">
<svg width="100%" height="100%" viewBox="0 0 120 120" version="1.1" xmlns="http://www.w3.org/2000/svg" xmlns:xlink="http://www.w3.org/1999/xlink" xml:space="preserve" xmlns:serif="http://www.serif.com/" style="fill-rule:evenodd;clip-rule:evenodd;stroke-linejoin:round;stroke-miterlimit:2;">
    <g id="logo" transform="matrix(0.164152,0,0,0.169587,-108.952,-104.392)">
        <rect x="663.723" y="615.569" width="731.029" height="707.603" style="fill:none;"/>
        <g transform="matrix(1.35163,0,0,1.30832,939.087,960.328)">
            <path d="M0,13.824C0,26.126 -9.973,36.098 -22.274,36.098C-34.576,36.098 -44.549,26.126 -44.549,13.824C-44.549,1.522 -34.576,-8.45 -22.274,-8.45C-9.973,-8.45 0,1.522 0,13.824M133.398,13.824C133.398,1.522 143.371,-8.45 155.672,-8.45C167.974,-8.45 177.947,1.522 177.947,13.824C177.947,26.126 167.974,36.098 155.672,36.098C143.371,36.098 133.398,26.126 133.398,13.824M220.161,70.483C211.789,90.685 199.665,108.81 184.127,124.342C172.546,135.93 159.414,145.692 145.096,153.358C142.963,154.502 140.591,155.082 138.209,155.082C136.594,155.082 134.974,154.816 133.422,154.276C129.597,152.94 126.481,150.049 124.873,146.336C121.9,139.467 124.685,131.359 131.212,127.883C143.081,121.543 153.985,113.45 163.614,103.826C176.435,91.006 186.443,76.049 193.362,59.371C200.258,42.734 203.757,25.081 203.757,6.912C203.757,-11.264 200.258,-28.912 193.359,-45.546C186.446,-62.225 176.435,-77.182 163.614,-90.001C155.104,-98.513 145.59,-105.823 135.253,-111.801L85.236,139.678C83.446,148.634 75.825,154.885 66.701,154.885C57.575,154.885 49.954,148.634 48.164,139.682L-1.859,-111.801C-12.19,-105.828 -21.706,-98.515 -30.214,-90.003C-43.043,-77.175 -53.053,-62.217 -59.965,-45.546C-66.861,-28.912 -70.358,-11.261 -70.358,6.912C-70.358,25.088 -66.861,42.734 -59.965,59.371C-53.057,76.038 -43.045,90.995 -30.214,103.826C-20.595,113.445 -9.693,121.538 2.187,127.879C8.708,131.364 11.49,139.467 8.521,146.331L8.519,146.336C6.914,150.044 3.797,152.935 -0.023,154.271C-3.86,155.612 -8.112,155.283 -11.7,153.358C-26.011,145.697 -39.143,135.93 -50.733,124.342C-66.262,108.81 -78.386,90.69 -86.77,70.483C-95.133,50.302 -99.375,28.912 -99.375,6.912C-99.375,-15.089 -95.133,-36.476 -86.771,-56.661C-78.386,-76.87 -66.262,-94.99 -50.731,-110.519C-36.802,-124.451 -20.707,-135.688 -2.894,-143.918C1.855,-146.103 7.196,-146.417 11.75,-144.77C18.092,-142.487 22.664,-137.198 23.977,-130.628L66.696,84.125L109.413,-130.616C110.736,-137.213 115.32,-142.504 121.673,-144.777C126.243,-146.42 131.581,-146.096 136.329,-143.901C154.123,-135.671 170.207,-124.441 184.127,-110.522C199.662,-94.99 211.786,-76.868 220.164,-56.661C228.528,-36.496 232.771,-15.106 232.771,6.912C232.771,28.927 228.528,50.316 220.161,70.483M66.697,-140.471C78.999,-140.471 88.971,-130.499 88.971,-118.197C88.971,-105.895 78.999,-95.923 66.697,-95.923C54.395,-95.923 44.422,-105.895 44.422,-118.197C44.422,-130.499 54.395,-140.471 66.697,-140.471M66.699,-218.442C-57.762,-218.442 -158.657,-117.547 -158.657,6.912C-158.657,131.372 -57.762,232.266 66.699,232.266C191.158,232.266 292.052,131.372 292.052,6.912C292.052,-117.547 191.158,-218.442 66.699,-218.442" style="fill:white;fill-rule:nonzero;"/>
        </g>
    </g>
</svg>
