commit 02fcb3a0e16e0130226bf8b703ab31cfe8106702
Merge: e9d8f71 26d26a1
Author: Yashodha Chaku <yashodha@cividesk.com>
Date:   Thu Oct 10 20:07:30 2024 +0530

    Merge pull request #21 from eileenmcnaughton/master
    
    Run civix for Smarty3+ support, Increment version to 1.2
