role,anonymous user,authenticated user,administrator,client administrator,ESCR-Net limited administrator,PetsAlive Limited User
rid,1,2,3,4,8,11
add contacts,,,X,X,X,X
view all contacts,,,X,X,X,X
edit all contacts,,,X,X,X,X
view my contact,,,X,X,X,X
edit my contact,,,X,X,X,X
delete contacts,,,X,X,,
access deleted contacts,,,X,X,,
import contacts,,,X,X,X,
import SQL datasource,,,X,X,,
edit groups,,,X,X,X,X
administer CiviCRM,,,X,X,,
skip IDS check,,,X,X,,
access uploaded files,X,,X,X,X,X
profile listings and forms,X,,X,X,X,X
profile listings,X,,X,X,X,X
profile create,X,,X,X,X,X
profile edit,X,,X,X,X,X
profile view,X,,X,X,X,X
access all custom data,X,,X,X,X,X
view all activities,,,X,X,X,X
delete activities,,,X,X,,
access CiviCRM,,,X,X,X,X
access Contact Dashboard,,,X,X,X,X
translate CiviCRM,,,X,X,,X
manage tags,,,X,X,,
administer reserved groups,,,X,,,
administer Tagsets,,,X,X,,
administer reserved tags,,,X,X,,
administer dedupe rules,,,X,X,,
merge duplicate contacts,,,X,X,X,X
force merge duplicate contacts,,,,,,
view debug output,,,X,,,X
view all notes,,,X,X,X,X
access AJAX API,X,,X,X,,X
access contact reference fields,X,,X,X,X,X
create manual batch,,,X,X,,X
edit own manual batches,,,X,X,,X
edit all manual batches,,,X,X,,X
view own manual batches,,,X,X,,X
view all manual batches,,,X,X,,X
delete own manual batches,,,X,X,,X
delete all manual batches,,,X,X,,X
export own manual batches,,,X,X,,X
close all manual batches,,,X,X,,
close own manual batches,,,X,X,,
reopen own manual batches,,,X,X,,
reopen all manual batches,,,X,X,,
export all manual batches,,,X,X,,X
administer payment processors,,,X,,,X
edit message templates,,,X,X,X,X
view my invoices,,,X,X,X,X
edit api keys,,,,,,
edit own api keys,,,,,,
access CiviEvent,,,X,X,X,X
edit event participants,,,X,X,X,X
edit all events,,,X,X,X,X
register for events,X,,X,X,X,X
view event info,X,,X,X,X,X
view event participants,,,X,X,X,X
delete in CiviEvent,,,X,X,,
manage event profiles,,,X,X,X,X
access CiviContribute,,,X,X,X,X
edit contributions,,,X,X,x,X
make online contributions,X,,X,X,X,X
delete in CiviContribute,,,X,X,,
access CiviMember,,,X,X,,
edit memberships,,,X,X,,
delete in CiviMember,,,X,X,,
access CiviMail,,,X,X,X,
access CiviMail subscribe/unsubscribe pages,X,,X,X,X,X
delete in CiviMail,,,X,X,,
view public CiviMail content,X,,X,X,X,X
access CiviPledge,,,X,X,,
edit pledges,,,X,X,,
delete in CiviPledge,,,X,X,,
access CiviReport,,,X,X,X,X
access Report Criteria,,,X,X,X,X
administer private reports,,,X,,,
administer reserved reports,,,X,,,X
administer Reports,,,X,X,X,X
view report sql,,,X,,,
administer CiviCampaign,,,X,,,
manage campaign,,,X,X,X,
reserve campaign contacts,,,X,X,X,
release campaign contacts,,,X,X,X,
interview campaign contacts,,,X,X,X,
gotv campaign contacts,,,X,X,X,
sign CiviCRM Petition,X,X,X,X,X,
register to volunteer,,,X,X,X,
log own hours,,,X,X,X,
create volunteer projects,,,X,X,X,
edit own volunteer projects,,,X,X,X,
edit all volunteer projects,,,X,X,X,
delete own volunteer projects,,,X,X,X,
delete all volunteer projects,,,X,X,X,
edit volunteer project relationships,,,X,X,X,
edit volunteer registration profiles,,,X,X,X,
access CiviGrant,,,X,X,,
edit grants,,,X,X,,
delete in CiviGrant,,,X,X,,
delete in CiviCase,,,X,X,,
administer CiviCase,,,X,X,,
access my cases and activities,,,X,X,,
access all cases and activities,,,X,X,,
add cases,,,X,X,,
add contact notes,,,X,X,,
administer GDPR,,,X,X,,
access GDPR,,,X,X,,
forget contact,,,X,X,,
allow webhook posts,X,X,X,X,X,