{
	"info": {
		"_postman_id": "a1f5d466-c284-4aee-9d99-7a0774af2267",
		"name": "Capstone",
		"schema": "https://schema.getpostman.com/json/collection/v2.1.0/collection.json",
		"_exporter_id": "23633859"
	},
	"item": [
		{
			"name": "Register User",
			"request": {
				"method": "POST",
				"header": [],
				"body": {
					"mode": "raw",
					"raw": "{\r\n    \"username\": \"gelyn\",\r\n    \"password\": \"123\"\r\n\r\n}",
					"options": {
						"raw": {
							"language": "json"
						}
					}
				},
				"url": {
					"raw": "localhost:8080/users/register",
					"host": [
						"localhost"
					],
					"port": "8080",
					"path": [
						"users",
						"register"
					]
				}
			},
			"response": []
		},
		{
			"name": "User Authenticate",
			"request": {
				"method": "POST",
				"header": [],
				"body": {
					"mode": "raw",
					"raw": "{\r\n    \"username\": \"gelyn\",\r\n    \"password\": \"123\"\r\n}",
					"options": {
						"raw": {
							"language": "json"
						}
					}
				},
				"url": {
					"raw": "localhost:8080/authenticate",
					"host": [
						"localhost"
					],
					"port": "8080",
					"path": [
						"authenticate"
					]
				}
			},
			"response": []
		},
		{
			"name": "Add Course",
			"request": {
				"method": "POST",
				"header": [
					{
						"key": "Authorization",
						"value": "eyJhbGciOiJIUzUxMiJ9.eyJzdWIiOiJnZWx5biIsImV4cCI6MTY4Mjc3ODk3NSwidXNlciI6MSwiaWF0IjoxNjgyNzYwOTc1fQ.oQLH5YJg5DF9EoB15G09L7EEc786ShAvPObT3e955MsxShWCyhlbnol5jQlo5juAsMwZboMB0_yeySWpXP9TYQ",
						"type": "text"
					}
				],
				"body": {
					"mode": "raw",
					"raw": "{\r\n    \"name\": \"Zuitt\",\r\n    \"description\": \" CSIT343\",\r\n    \"price\": \"400\"\r\n}",
					"options": {
						"raw": {
							"language": "json"
						}
					}
				},
				"url": {
					"raw": "localhost:8080/courses",
					"host": [
						"localhost"
					],
					"port": "8080",
					"path": [
						"courses"
					]
				}
			},
			"response": []
		},
		{
			"name": "Get All courses",
			"request": {
				"method": "GET",
				"header": [
					{
						"key": "Authorization",
						"value": "eyJhbGciOiJIUzUxMiJ9.eyJzdWIiOiJhbmdlbHluIiwiZXhwIjoxNjgzMTEyMjc2LCJ1c2VyIjozLCJpYXQiOjE2ODMwOTQyNzZ9.ivf5AwJ4K44mdgf9jsOvJcy-Ww8zOpjmPP-9XmsTix3ym9vDKCfoIiOXEVwR6RgorWOx8p2H7OaQHnXn01uj1A",
						"type": "text"
					}
				],
				"url": {
					"raw": "localhost:8080/course",
					"host": [
						"localhost"
					],
					"port": "8080",
					"path": [
						"course"
					]
				}
			},
			"response": []
		},
		{
			"name": "Update Course",
			"request": {
				"method": "PUT",
				"header": [
					{
						"key": "Authorization",
						"value": "eyJhbGciOiJIUzUxMiJ9.eyJzdWIiOiJhbmdlbHluIiwiZXhwIjoxNjgzMTEyMjc2LCJ1c2VyIjozLCJpYXQiOjE2ODMwOTQyNzZ9.ivf5AwJ4K44mdgf9jsOvJcy-Ww8zOpjmPP-9XmsTix3ym9vDKCfoIiOXEVwR6RgorWOx8p2H7OaQHnXn01uj1A",
						"type": "text"
					}
				],
				"body": {
					"mode": "raw",
					"raw": "{\r\n    \"name\": \" FREEEL\",\r\n    \"description\": \"CSIT333\",\r\n    \"price\":  \"340\"\r\n}",
					"options": {
						"raw": {
							"language": "json"
						}
					}
				},
				"url": {
					"raw": "localhost:8080/course/4",
					"host": [
						"localhost"
					],
					"port": "8080",
					"path": [
						"course",
						"4"
					]
				}
			},
			"response": []
		},
		{
			"name": "Delete Course",
			"request": {
				"method": "DELETE",
				"header": [
					{
						"key": "Authorization",
						"value": "eyJhbGciOiJIUzUxMiJ9.eyJzdWIiOiJhbmdlbHluIiwiZXhwIjoxNjgzMTEyMjc2LCJ1c2VyIjozLCJpYXQiOjE2ODMwOTQyNzZ9.ivf5AwJ4K44mdgf9jsOvJcy-Ww8zOpjmPP-9XmsTix3ym9vDKCfoIiOXEVwR6RgorWOx8p2H7OaQHnXn01uj1A",
						"type": "text"
					}
				],
				"url": {
					"raw": "localhost:8080/course/4",
					"host": [
						"localhost"
					],
					"port": "8080",
					"path": [
						"course",
						"4"
					]
				}
			},
			"response": []
		}
	]
}