C:\Users\aparr\Documents\CITG1\s11\discussion\src\main\java\com\zuitt\discussion\models\Post.java
C:\Users\aparr\Documents\CITG1\s11\discussion\src\main\java\com\zuitt\discussion\repositories\PostRepository.java
C:\Users\aparr\Documents\CITG1\s11\discussion\src\main\java\com\zuitt\discussion\ServletInitializer.java
C:\Users\aparr\Documents\CITG1\s11\discussion\src\main\java\com\zuitt\discussion\DiscussionApplication.java
