{
    "@context": "\/api\/contexts\/ExternalEvent",
    "@id": "\/api\/external_events",
    "@type": "hydra:Collection",
    "hydra:member": [
        {
            "@id": "\/api\/external_events\/12",
            "@type": "ExternalEvent",
            "source": "larem",
            "sourceId": "dc91b588-77c0-4c56-b668-0f0e863a5361",
            "title": "Réunion conviviale de rentrée inter -  comités.",
            "slug": "2019-09-17-reunion-conviviale-de-rentree-inter-comites",
            "date": "2019-09-17T19:00:00+02:00",
            "url": "https:\/\/en-marche.fr\/evenements\/2019-09-17-reunion-conviviale-de-rentree-inter-comites",
            "latitude": "48.8306350",
            "longitude": "2.3567620",
            "address": "194  avenue de Choisy  -  Café  La  Place",
            "zipCode": "75013",
            "city": "Paris 13e",
            "country": "FR",
            "id": 12,
            "updatedAt": "2019-09-17T18:44:25+02:00"
        },
        {
            "@id": "\/api\/external_events\/65",
            "@type": "ExternalEvent",
            "source": "larem",
            "sourceId": "cb7887ed-92ff-4d50-812f-5a5fe4777c73",
            "title": "Tractage Paris 14 avec Benjamin Griveaux",
            "slug": "2019-09-19-tractage-paris-14-avec-benjamin-griveaux",
            "date": "2019-09-19T18:15:00+02:00",
            "url": "https:\/\/en-marche.fr\/evenements\/2019-09-19-tractage-paris-14-avec-benjamin-griveaux",
            "latitude": "48.8285670",
            "longitude": "2.3270380",
            "address": "Devant l'Eglise St Pierre de Montrouge. 82 Avenue du Général Leclerc",
            "zipCode": "75014",
            "city": "Paris 14e",
            "country": "FR",
            "id": 65,
            "updatedAt": "2019-09-17T18:44:25+02:00"
        },
        {
            "@id": "\/api\/external_events\/83",
            "@type": "ExternalEvent",
            "source": "larem",
            "sourceId": "56988f84-8bcb-4a1f-a325-a0b8e36e75cf",
            "title": "Plenière de rentrée : \"L'espace Public\"",
            "slug": "2019-09-19-pleniere-de-rentree-lespace-public",
            "date": "2019-09-19T19:30:00+02:00",
            "url": "https:\/\/en-marche.fr\/evenements\/2019-09-19-pleniere-de-rentree-lespace-public",
            "latitude": "48.8335620",
            "longitude": "2.3177180",
            "address": "A definir",
            "zipCode": "75014",
            "city": "Paris 14e",
            "country": "FR",
            "id": 83,
            "updatedAt": "2019-09-17T18:44:25+02:00"
        },
        {
            "@id": "\/api\/external_events\/89",
            "@type": "ExternalEvent",
            "source": "larem",
            "sourceId": "c5393619-23c4-4bf9-b057-d4f0872c5432",
            "title": "Rentrée politique de LaREM Paris 13",
            "slug": "2019-09-19-rentree-politique-de-larem-paris-13",
            "date": "2019-09-19T19:30:00+02:00",
            "url": "https:\/\/en-marche.fr\/evenements\/2019-09-19-rentree-politique-de-larem-paris-13",
            "latitude": "48.8280290",
            "longitude": "2.3570500",
            "address": "29 avenue d'Italie",
            "zipCode": "75013",
            "city": "Paris 13e",
            "country": "FR",
            "id": 89,
            "updatedAt": "2019-09-17T18:44:25+02:00"
        },
        {
            "@id": "\/api\/external_events\/105",
            "@type": "ExternalEvent",
            "source": "larem",
            "sourceId": "0c1991cb-ab8f-4a97-875e-6aaadbc1da9f",
            "title": "Quatorziens, parlons École ! - Paris 14e",
            "slug": "2019-09-20-quatorziens-parlons-ecole-paris-14e",
            "date": "2019-09-20T16:30:00+02:00",
            "url": "https:\/\/en-marche.fr\/evenements\/2019-09-20-quatorziens-parlons-ecole-paris-14e",
            "latitude": "48.8334190",
            "longitude": "2.3240690",
            "address": "Place de l’abbé leboeuf à l’angle de la rue de l’ouest et de la rue du château",
            "zipCode": "75014",
            "city": "Paris 14e",
            "country": "FR",
            "id": 105,
            "updatedAt": "2019-09-17T18:44:25+02:00"
        },
        {
            "@id": "\/api\/external_events\/106",
            "@type": "ExternalEvent",
            "source": "larem",
            "sourceId": "cede4475-6d25-4618-9fb2-be379d0cf65b",
            "title": "Quatorziens, Parlons École ! Place Lebeuf",
            "slug": "2019-09-20-quatorziens-parlons-ecole-place-lebeuf",
            "date": "2019-09-20T16:30:00+02:00",
            "url": "https:\/\/en-marche.fr\/evenements\/2019-09-20-quatorziens-parlons-ecole-place-lebeuf",
            "latitude": "48.8361970",
            "longitude": "2.3187510",
            "address": "Place de l’Abbé Lebeuf",
            "zipCode": "75014",
            "city": "Paris 14e",
            "country": "FR",
            "id": 106,
            "updatedAt": "2019-09-17T18:44:25+02:00"
        },
        {
            "@id": "\/api\/external_events\/163",
            "@type": "ExternalEvent",
            "source": "larem",
            "sourceId": "6f3f9cf0-2184-4038-836e-4f6e228f2d89",
            "title": "Quatorziens, parlons école !",
            "slug": "2019-09-21-quatorziens-parlons-ecole",
            "date": "2019-09-21T11:00:00+02:00",
            "url": "https:\/\/en-marche.fr\/evenements\/2019-09-21-quatorziens-parlons-ecole",
            "latitude": "48.8266680",
            "longitude": "2.3260840",
            "address": "102 avenue du Général Leclerc",
            "zipCode": "75014",
            "city": "Paris 14e",
            "country": "FR",
            "id": 163,
            "updatedAt": "2019-09-17T18:44:25+02:00"
        },
        {
            "@id": "\/api\/external_events\/164",
            "@type": "ExternalEvent",
            "source": "larem",
            "sourceId": "b18d3172-04e6-4523-9cca-e0331ecacbdb",
            "title": "Tractâge éducation",
            "slug": "2019-09-21-tractage-education",
            "date": "2019-09-21T11:00:00+02:00",
            "url": "https:\/\/en-marche.fr\/evenements\/2019-09-21-tractage-education",
            "latitude": "48.8266680",
            "longitude": "2.3260840",
            "address": "102 avenue Générale Leclerc",
            "zipCode": "75014",
            "city": "Paris 14e",
            "country": "FR",
            "id": 164,
            "updatedAt": "2019-09-17T18:44:25+02:00"
        },
        {
            "@id": "\/api\/external_events\/239",
            "@type": "ExternalEvent",
            "source": "larem",
            "sourceId": "986029ea-3c26-4000-bc1b-7f636cb22a50",
            "title": "COMITE DE RENTREE",
            "slug": "2019-09-24-comite-de-rentree",
            "date": "2019-09-24T19:30:00+02:00",
            "url": "https:\/\/en-marche.fr\/evenements\/2019-09-24-comite-de-rentree",
            "latitude": "48.8296030",
            "longitude": "2.3339010",
            "address": "LE COMPTOIR - 18 avenue René Coty",
            "zipCode": "75014",
            "city": "Paris 14e",
            "country": "FR",
            "id": 239,
            "updatedAt": "2019-09-17T18:44:25+02:00"
        },
        {
            "@id": "\/api\/external_events\/278",
            "@type": "ExternalEvent",
            "source": "larem",
            "sourceId": "03c43e67-41c9-4fee-bc05-035b3ae74465",
            "title": "Réunion de rentrée du Comité Montparnasse",
            "slug": "2019-09-26-reunion-de-rentree-du-comite-montparnasse",
            "date": "2019-09-26T19:30:00+02:00",
            "url": "https:\/\/en-marche.fr\/evenements\/2019-09-26-reunion-de-rentree-du-comite-montparnasse",
            "latitude": "48.8395640",
            "longitude": "2.3224180",
            "address": "Pizza Roma 61 Avenue du Maine",
            "zipCode": "75014",
            "city": "Paris 14e",
            "country": "FR",
            "id": 278,
            "updatedAt": "2019-09-17T18:44:25+02:00"
        }
    ],
    "hydra:totalItems": 10,
    "hydra:view": {
        "@id": "\/api\/external_events?zipCode%5B%5D=75014&zipCode%5B%5D=75013",
        "@type": "hydra:PartialCollectionView"
    },
    "hydra:search": {
        "@type": "hydra:IriTemplate",
        "hydra:template": "\/api\/external_events{?zipCode,zipCode[]}",
        "hydra:variableRepresentation": "BasicRepresentation",
        "hydra:mapping": [
            {
                "@type": "IriTemplateMapping",
                "variable": "zipCode",
                "property": "zipCode",
                "required": false
            },
            {
                "@type": "IriTemplateMapping",
                "variable": "zipCode[]",
                "property": "zipCode",
                "required": false
            }
        ]
    }
}
