{
    "@context": "\/api\/contexts\/Post",
    "@id": "\/api\/posts",
    "@type": "hydra:Collection",
    "hydra:member": [
        {
            "@id": "\/api\/posts\/251",
            "@type": "Post",
            "title": "Temporibus qui ad est.",
            "slug": "temporibus-qui-ad-est",
            "metaTitle": null,
            "metaDescription": null,
            "image": null,
            "publishedAt": "2019-07-04T22:18:56+02:00",
            "categories": [
                {
                    "@id": "\/api\/post_categories\/33",
                    "@type": "PostCategory",
                    "name": "Événements",
                    "slug": "evenements",
                    "weight": 3,
                    "id": 33,
                    "createdAt": "2019-07-05T00:18:44+02:00",
                    "updatedAt": "2019-07-05T00:18:44+02:00"
                }
            ],
            "id": 251,
            "createdAt": "2019-06-22T20:38:57+02:00",
            "updatedAt": "2019-06-19T13:01:28+02:00"
        },
        {
            "@id": "\/api\/posts\/252",
            "@type": "Post",
            "title": "Eius voluptas numquam quam occaecati culpa aut.",
            "slug": "eius-voluptas-numquam-quam-occaecati-culpa-aut",
            "metaTitle": null,
            "metaDescription": null,
            "image": null,
            "publishedAt": "2019-07-04T22:18:56+02:00",
            "categories": [
                {
                    "@id": "\/api\/post_categories\/33",
                    "@type": "PostCategory",
                    "name": "Événements",
                    "slug": "evenements",
                    "weight": 3,
                    "id": 33,
                    "createdAt": "2019-07-05T00:18:44+02:00",
                    "updatedAt": "2019-07-05T00:18:44+02:00"
                }
            ],
            "id": 252,
            "createdAt": "2019-06-21T18:40:46+02:00",
            "updatedAt": "2019-06-18T11:53:04+02:00"
        },
        {
            "@id": "\/api\/posts\/253",
            "@type": "Post",
            "title": "Et aut laborum cupiditate corporis aliquid aut cumque.",
            "slug": "et-aut-laborum-cupiditate-corporis-aliquid-aut-cumque",
            "metaTitle": null,
            "metaDescription": null,
            "image": null,
            "publishedAt": "2019-07-04T22:18:56+02:00",
            "categories": [
                {
                    "@id": "\/api\/post_categories\/33",
                    "@type": "PostCategory",
                    "name": "Événements",
                    "slug": "evenements",
                    "weight": 3,
                    "id": 33,
                    "createdAt": "2019-07-05T00:18:44+02:00",
                    "updatedAt": "2019-07-05T00:18:44+02:00"
                }
            ],
            "id": 253,
            "createdAt": "2019-06-08T15:45:29+02:00",
            "updatedAt": "2019-06-20T08:23:20+02:00"
        },
        {
            "@id": "\/api\/posts\/254",
            "@type": "Post",
            "title": "Est maiores aliquid rerum autem.",
            "slug": "est-maiores-aliquid-rerum-autem",
            "metaTitle": null,
            "metaDescription": null,
            "image": null,
            "publishedAt": "2019-07-04T22:18:56+02:00",
            "categories": [
                {
                    "@id": "\/api\/post_categories\/33",
                    "@type": "PostCategory",
                    "name": "Événements",
                    "slug": "evenements",
                    "weight": 3,
                    "id": 33,
                    "createdAt": "2019-07-05T00:18:44+02:00",
                    "updatedAt": "2019-07-05T00:18:44+02:00"
                }
            ],
            "id": 254,
            "createdAt": "2019-06-26T02:57:26+02:00",
            "updatedAt": "2019-06-26T00:05:58+02:00"
        },
        {
            "@id": "\/api\/posts\/255",
            "@type": "Post",
            "title": "Excepturi et necessitatibus tenetur doloremque.",
            "slug": "excepturi-et-necessitatibus-tenetur-doloremque",
            "metaTitle": null,
            "metaDescription": null,
            "image": null,
            "publishedAt": "2019-07-04T22:18:56+02:00",
            "categories": [
                {
                    "@id": "\/api\/post_categories\/33",
                    "@type": "PostCategory",
                    "name": "Événements",
                    "slug": "evenements",
                    "weight": 3,
                    "id": 33,
                    "createdAt": "2019-07-05T00:18:44+02:00",
                    "updatedAt": "2019-07-05T00:18:44+02:00"
                }
            ],
            "id": 255,
            "createdAt": "2019-06-17T15:50:36+02:00",
            "updatedAt": "2019-06-28T03:40:09+02:00"
        },
        {
            "@id": "\/api\/posts\/256",
            "@type": "Post",
            "title": "Beatae voluptas iure rerum voluptas necessitatibus eius.",
            "slug": "beatae-voluptas-iure-rerum-voluptas-necessitatibus-eius",
            "metaTitle": null,
            "metaDescription": null,
            "image": null,
            "publishedAt": "2019-07-04T22:18:56+02:00",
            "categories": [
                {
                    "@id": "\/api\/post_categories\/33",
                    "@type": "PostCategory",
                    "name": "Événements",
                    "slug": "evenements",
                    "weight": 3,
                    "id": 33,
                    "createdAt": "2019-07-05T00:18:44+02:00",
                    "updatedAt": "2019-07-05T00:18:44+02:00"
                }
            ],
            "id": 256,
            "createdAt": "2019-06-15T14:28:53+02:00",
            "updatedAt": "2019-06-17T18:20:16+02:00"
        },
        {
            "@id": "\/api\/posts\/257",
            "@type": "Post",
            "title": "Aliquid et sit enim molestias.",
            "slug": "aliquid-et-sit-enim-molestias",
            "metaTitle": null,
            "metaDescription": null,
            "image": null,
            "publishedAt": "2019-07-04T22:18:56+02:00",
            "categories": [
                {
                    "@id": "\/api\/post_categories\/33",
                    "@type": "PostCategory",
                    "name": "Événements",
                    "slug": "evenements",
                    "weight": 3,
                    "id": 33,
                    "createdAt": "2019-07-05T00:18:44+02:00",
                    "updatedAt": "2019-07-05T00:18:44+02:00"
                }
            ],
            "id": 257,
            "createdAt": "2019-06-21T17:57:19+02:00",
            "updatedAt": "2019-06-26T07:21:37+02:00"
        },
        {
            "@id": "\/api\/posts\/258",
            "@type": "Post",
            "title": "Repudiandae qui voluptatem distinctio modi officiis.",
            "slug": "repudiandae-qui-voluptatem-distinctio-modi-officiis",
            "metaTitle": null,
            "metaDescription": null,
            "image": null,
            "publishedAt": "2019-07-04T22:18:56+02:00",
            "categories": [
                {
                    "@id": "\/api\/post_categories\/33",
                    "@type": "PostCategory",
                    "name": "Événements",
                    "slug": "evenements",
                    "weight": 3,
                    "id": 33,
                    "createdAt": "2019-07-05T00:18:44+02:00",
                    "updatedAt": "2019-07-05T00:18:44+02:00"
                }
            ],
            "id": 258,
            "createdAt": "2019-06-30T00:45:19+02:00",
            "updatedAt": "2019-06-14T17:55:02+02:00"
        },
        {
            "@id": "\/api\/posts\/259",
            "@type": "Post",
            "title": "Vel ut modi quia recusandae qui eligendi.",
            "slug": "vel-ut-modi-quia-recusandae-qui-eligendi",
            "metaTitle": null,
            "metaDescription": null,
            "image": null,
            "publishedAt": "2019-07-04T22:18:56+02:00",
            "categories": [
                {
                    "@id": "\/api\/post_categories\/33",
                    "@type": "PostCategory",
                    "name": "Événements",
                    "slug": "evenements",
                    "weight": 3,
                    "id": 33,
                    "createdAt": "2019-07-05T00:18:44+02:00",
                    "updatedAt": "2019-07-05T00:18:44+02:00"
                }
            ],
            "id": 259,
            "createdAt": "2019-06-25T16:30:23+02:00",
            "updatedAt": "2019-06-27T05:18:50+02:00"
        },
        {
            "@id": "\/api\/posts\/260",
            "@type": "Post",
            "title": "Asperiores ab tenetur voluptatem repudiandae reiciendis.",
            "slug": "asperiores-ab-tenetur-voluptatem-repudiandae-reiciendis",
            "metaTitle": null,
            "metaDescription": null,
            "image": null,
            "publishedAt": "2019-07-04T22:18:56+02:00",
            "categories": [
                {
                    "@id": "\/api\/post_categories\/33",
                    "@type": "PostCategory",
                    "name": "Événements",
                    "slug": "evenements",
                    "weight": 3,
                    "id": 33,
                    "createdAt": "2019-07-05T00:18:44+02:00",
                    "updatedAt": "2019-07-05T00:18:44+02:00"
                }
            ],
            "id": 260,
            "createdAt": "2019-06-24T15:00:01+02:00",
            "updatedAt": "2019-06-30T04:25:16+02:00"
        }
    ],
    "hydra:totalItems": 100,
    "hydra:view": {
        "@id": "\/api\/posts?page=4",
        "@type": "hydra:PartialCollectionView",
        "hydra:first": "\/api\/posts?page=1",
        "hydra:last": "\/api\/posts?page=4",
        "hydra:previous": "\/api\/posts?page=3"
    },
    "hydra:search": {
        "@type": "hydra:IriTemplate",
        "hydra:template": "\/api\/posts{?categories,categories[]}",
        "hydra:variableRepresentation": "BasicRepresentation",
        "hydra:mapping": [
            {
                "@type": "IriTemplateMapping",
                "variable": "categories",
                "property": "categories",
                "required": false
            },
            {
                "@type": "IriTemplateMapping",
                "variable": "categories[]",
                "property": "categories",
                "required": false
            }
        ]
    }
}
