{
    "@context": "\/api\/contexts\/ProgramTopic",
    "@id": "\/api\/program_topics",
    "@type": "hydra:Collection",
    "hydra:member": [
        {
            "@id": "\/api\/program_topics\/13",
            "@type": "ProgramTopic",
            "title": "Faire de l'Europe une puissance verte",
            "slug": "faire-de-l-europe-une-puissance-verte",
            "position": 1,
            "image": "http:\/\/localhost\/assets\/image\/test-project\/content-image\/571a9a71-36b2-48fe-aaff-ed622c4478bf.jpg",
            "color": "26b255",
            "publishedAt": "2020-01-22T15:02:50+01:00",
            "id": 13,
            "updatedAt": "2020-01-22T19:01:24+01:00"
        },
        {
            "@id": "\/api\/program_topics\/14",
            "@type": "ProgramTopic",
            "title": "Bâtir l'Europe de la justice sociale et fiscale",
            "slug": "batir-l-europe-de-la-justice-sociale-et-fiscale",
            "position": 2,
            "image": null,
            "color": "000000",
            "publishedAt": "2020-01-22T16:26:59+01:00",
            "id": 14,
            "updatedAt": "2020-01-22T18:42:39+01:00"
        },
        {
            "@id": "\/api\/program_topics\/15",
            "@type": "ProgramTopic",
            "title": "Faire respecter l'Europe dans la mondialisation",
            "slug": "faire-respecter-l-europe-dans-la-mondialisation",
            "position": 3,
            "image": null,
            "color": "000000",
            "publishedAt": "2020-01-22T02:38:51+01:00",
            "id": 15,
            "updatedAt": "2020-01-22T12:42:54+01:00"
        }
    ],
    "hydra:totalItems": 3
}
