{
    "@context": "\/api\/contexts\/Page",
    "@id": "\/api\/pages",
    "@type": "hydra:Collection",
    "hydra:member": [],
    "hydra:totalItems": 0,
    "hydra:view": {
        "@id": "\/api\/pages?slug=mentions-legales",
        "@type": "hydra:PartialCollectionView"
    },
    "hydra:search": {
        "@type": "hydra:IriTemplate",
        "hydra:template": "\/api\/pages{?slug,slug[]}",
        "hydra:variableRepresentation": "BasicRepresentation",
        "hydra:mapping": [
            {
                "@type": "IriTemplateMapping",
                "variable": "slug",
                "property": "slug",
                "required": false
            },
            {
                "@type": "IriTemplateMapping",
                "variable": "slug[]",
                "property": "slug",
                "required": false
            }
        ]
    }
}
