{
    "searchSettings": {
        "nResults":50,
        "nHits":15
    },
    "displayText":{
        "loginPage":{
            "title": "Protokollsök",
            "passwordLabel": "Lösenord",
            "stayLoggedIn": "Spara lösenord",
            "loginButtonText": "LOGGA IN"
        },
        "searchPage":{
            "title":"Dokumentsök",
            "tab1Text": "Alla protokoll",
            "tab2Text": "Diagramöversikt",
            "searchResultStats":{
                "nDocsLabel": "Protokoll",
                "nSentencesLabel": "Antal meningar"
            },
            "addSentenceDialogueAddLabel":"Lägg till etikett",
            "docStatsBarChart":{
                "yAxisLabel":"Antal protokol",
                "title":"Protokoll per län"
            },
            "filterLabel":"Välj kommun" 
        },
        "navbar":{
            "searchLabel": "Sök",
            "fileManagerLabel": "Filhanteraren",
            "settingsLabel":"Inställningar",
            "classifierLabel": "Klassificerare"
        },
        "classifierPage":{
            "classifierLabel": "Klassificerare",
            "AddSentenceLabel":"Lägg till meningen till biblioteket",
            "classifyButtonText": "Klassificera",
            "textBoxPlaceholder": "Skriv text här..."
        }
    }
}