<?xml version="1.0" encoding="UTF-8" standalone="no"?>
<!-- Created with Inkscape (http://www.inkscape.org/) -->

<svg
   xmlns:dc="http://purl.org/dc/elements/1.1/"
   xmlns:cc="http://creativecommons.org/ns#"
   xmlns:rdf="http://www.w3.org/1999/02/22-rdf-syntax-ns#"
   xmlns:svg="http://www.w3.org/2000/svg"
   xmlns="http://www.w3.org/2000/svg"
   xmlns:sodipodi="http://sodipodi.sourceforge.net/DTD/sodipodi-0.dtd"
   xmlns:inkscape="http://www.inkscape.org/namespaces/inkscape"
   width="6.3815498mm"
   height="11.59713mm"
   viewBox="0 0 22.611791 41.092192"
   id="svg2"
   version="1.1"
   inkscape:version="0.91 r13725"
   sodipodi:docname="marker.svg">
  <defs
     id="defs4" />
  <sodipodi:namedview
     id="base"
     pagecolor="#ffffff"
     bordercolor="#666666"
     borderopacity="1.0"
     inkscape:pageopacity="0"
     inkscape:pageshadow="2"
     inkscape:zoom="15.839192"
     inkscape:cx="25.873667"
     inkscape:cy="14.696838"
     inkscape:document-units="px"
     inkscape:current-layer="layer1"
     showgrid="false"
     fit-margin-top="0"
     fit-margin-left="0"
     fit-margin-right="0"
     fit-margin-bottom="0"
     inkscape:window-width="1366"
     inkscape:window-height="709"
     inkscape:window-x="0"
     inkscape:window-y="0"
     inkscape:window-maximized="1"
     showguides="true"
     inkscape:guide-bbox="true">
    <sodipodi:guide
       position="5.0561582,19.096675"
       orientation="0,1"
       id="guide4165" />
    <sodipodi:guide
       position="26.011427,20.929097"
       orientation="0,1"
       id="guide4167" />
    <sodipodi:guide
       position="-33.582178,14.677258"
       orientation="0,1"
       id="guide4169" />
    <sodipodi:guide
       position="-35.728752,9.7527631"
       orientation="0,1"
       id="guide4173" />
  </sodipodi:namedview>
  <metadata
     id="metadata7">
    <rdf:RDF>
      <cc:Work
         rdf:about="">
        <dc:format>image/svg+xml</dc:format>
        <dc:type
           rdf:resource="http://purl.org/dc/dcmitype/StillImage" />
        <dc:title />
      </cc:Work>
    </rdf:RDF>
  </metadata>
  <g
     inkscape:label="Ebene 1"
     inkscape:groupmode="layer"
     id="layer1"
     transform="translate(-130.61172,-456.04006)">
    <path
       class="marker fill"
       style="opacity:1;fill:#313131;fill-opacity:1;stroke:#313131;stroke-width:0;stroke-linecap:round;stroke-linejoin:miter;stroke-miterlimit:4;stroke-dasharray:none;stroke-dashoffset:0;stroke-opacity:1"
       d="m 132.45435,496.12209 3.82888,0 0,-20.90971 c 0,-0.44589 0.38103,-0.7903 0.83279,-0.7903 l 9.72041,0 c 0.47587,0 0.83165,0.4017 0.83165,0.7903 l 0,20.90975 3.79872,0 0,-23.11164 c 0,-1.23799 -0.97601,-2.36021 -2.34045,-2.36021 -4.01523,-0.0279 -10.77193,-0.0468 -14.40638,0 -1.29485,0.0167 -2.25681,0.93392 -2.26562,2.32999 -0.0472,7.48142 0,15.66008 0,23.14186 z"
       id="rect4936-5"
       inkscape:connector-curvature="0"
       sodipodi:nodetypes="ccccccccccsscc" />
  </g>
</svg>
