<svg width="472" height="99" viewBox="0 0 472 99" fill="none" xmlns="http://www.w3.org/2000/svg">
<path d="M163.896 0.675918C162.316 0.675918 161 1.96016 161 3.58237V46.368C161 47.7875 161.987 48.7337 163.304 48.7337C164.62 48.7337 165.608 47.7875 165.608 46.368V27.983H174.889C183.314 27.983 188.251 22.8461 188.251 14.5323C188.251 6.75919 183.38 0.675918 174.362 0.675918H163.896ZM174.362 5.06939C180.023 5.06939 183.709 8.85454 183.709 14.5323C183.709 19.9396 180.55 23.6572 174.362 23.6572H165.608V5.06939H174.362Z" fill="#414141"/>
<path d="M205.374 13.586C197.541 13.586 192.604 18.4526 192.604 26.6312V35.7561C192.604 43.9347 197.607 48.7337 205.374 48.7337C213.339 48.7337 218.144 43.7995 218.144 35.7561V26.6312C218.144 18.5202 213.273 13.586 205.374 13.586ZM205.374 17.8443C210.311 17.8443 213.668 20.8859 213.668 26.2932V36.0941C213.668 41.4338 210.311 44.4755 205.374 44.4755C200.503 44.4755 197.08 41.4338 197.08 36.0941V26.2932C197.08 20.8859 200.503 17.8443 205.374 17.8443Z" fill="#414141"/>
<path d="M261.707 13.586C260.72 13.586 259.864 14.0591 259.535 15.2082L252.492 41.8394L245.646 15.6813C245.317 14.3295 244.395 13.586 243.079 13.586C241.828 13.586 240.841 14.3295 240.512 15.6813L233.732 41.907L226.689 15.2082C226.36 14.0591 225.504 13.586 224.517 13.586C223.134 13.586 222.344 14.6674 222.344 15.8165C222.344 16.1545 222.41 16.56 222.542 16.898L230.902 46.368C231.362 47.9902 232.35 48.7337 233.666 48.7337C235.114 48.7337 236.102 48.0578 236.562 46.4356L243.145 22.3053L249.661 46.4356C250.122 48.0578 251.044 48.7337 252.426 48.7337C253.808 48.7337 254.862 47.9902 255.322 46.368L263.682 16.898C263.814 16.56 263.879 16.1545 263.879 15.8165C263.879 14.6674 263.09 13.586 261.707 13.586Z" fill="#414141"/>
<path d="M280.284 13.586C272.846 13.586 268.107 18.5202 268.107 26.0229V36.2968C268.107 43.5292 272.583 48.7337 280.284 48.7337C283.049 48.7337 287.13 47.9226 290.026 46.5708C290.882 46.1653 291.277 45.4893 291.277 44.6106C291.277 43.4616 290.355 42.5153 289.17 42.5153C288.709 42.5153 288.315 42.6505 287.59 42.9208C285.418 43.7995 283.18 44.4755 280.284 44.4755C275.084 44.4755 272.583 40.9607 272.583 36.4996V32.8497H289.565C291.408 32.8497 292.461 31.3626 292.461 29.9432V26.0229C292.461 18.5878 287.788 13.586 280.284 13.586ZM280.284 17.8443C285.352 17.8443 287.985 20.9535 287.985 25.9553V28.5238H272.583V25.8201C272.583 20.9535 275.216 17.8443 280.284 17.8443Z" fill="#414141"/>
<path d="M308.538 13.586C303.404 13.586 299.783 17.1683 299.783 22.8461V46.4356C299.783 47.7875 300.771 48.7337 302.021 48.7337C303.338 48.7337 304.259 47.7875 304.259 46.4356V22.9812C304.259 19.8044 306.234 17.9118 308.801 17.9118C310.842 17.9118 312.158 18.385 312.948 18.385C314.199 18.385 315.12 17.5063 315.12 16.2896C315.12 15.1406 314.396 14.3295 313.277 14.0591C311.632 13.7212 310.184 13.586 308.538 13.586Z" fill="#414141"/>
<path d="M331.11 0C323.211 0 317.616 4.93421 317.616 11.761C317.616 17.7091 320.907 21.0211 325.581 23.3868L333.282 27.3071C337.495 29.4701 340.128 31.5654 340.128 36.2968C340.128 41.5014 335.915 44.3403 330.781 44.3403C327.226 44.3403 324.528 43.732 321.697 42.3801C320.71 41.907 320.315 41.7718 319.722 41.7718C318.472 41.7718 317.616 42.7181 317.616 44.0023C317.616 45.0162 318.077 45.6921 319.064 46.1653C322.684 47.8551 326.436 48.7337 330.781 48.7337C338.351 48.7337 344.736 44.1375 344.736 36.1617C344.736 28.659 340.128 25.6849 335.849 23.4544L328.214 19.6016C324.33 17.6415 322.224 15.6813 322.224 11.6258C322.224 7.57029 325.976 4.39347 330.847 4.39347C334.204 4.39347 336.508 4.93421 339.535 6.08327C340.26 6.35364 340.786 6.624 341.51 6.624C342.629 6.624 343.485 5.67772 343.485 4.46106C343.485 3.44719 343.09 2.77127 342.168 2.29812C338.943 0.675918 335.454 0 331.11 0Z" fill="#414141"/>
<path d="M352.518 0C351.268 0 350.28 0.946286 350.28 2.29812V39.0681C350.28 45.4893 354.098 48.7337 359.166 48.7337C360.483 48.7337 361.404 48.6662 362.787 48.3958C363.972 48.193 364.696 47.3819 364.696 46.2328C364.696 44.8134 363.708 44.0699 362.523 44.0699C361.668 44.0699 361.075 44.4079 359.298 44.4079C356.402 44.4079 354.756 42.6505 354.756 39.1357V18.6554H362.458C363.84 18.6554 364.696 17.7091 364.696 16.4924C364.696 15.2082 363.84 14.2619 362.458 14.2619H354.756V2.29812C354.756 0.946286 353.835 0 352.518 0Z" fill="#414141"/>
<path d="M391.176 13.586C389.925 13.586 388.938 14.5323 388.938 15.8841V43.2588C386.502 44.0023 383.935 44.4755 381.302 44.4755C376.234 44.4755 373.601 41.6366 373.601 36.77V15.8841C373.601 14.5323 372.614 13.586 371.363 13.586C370.046 13.586 369.125 14.5323 369.125 15.8841V36.6348C369.125 44.2727 373.206 48.7337 381.302 48.7337C384.791 48.7337 388.016 48.1254 391.242 47.044C392.69 46.5708 393.414 45.5569 393.414 44.2727V15.8841C393.414 14.5323 392.492 13.586 391.176 13.586Z" fill="#414141"/>
<path d="M423.322 0C422.006 0 421.084 0.946286 421.084 2.29812V16.2221C418.517 14.3971 415.489 13.586 412.922 13.586C406.142 13.586 401.14 17.7091 401.14 25.8877V36.432C401.14 44.6782 406.076 48.7337 413.383 48.7337C416.872 48.7337 420.36 48.193 423.586 46.9764C424.77 46.5708 425.56 45.5569 425.56 44.2051V2.29812C425.56 0.946286 424.573 0 423.322 0ZM413.383 17.8443C416.082 17.8443 418.846 18.9257 421.084 20.8183V43.3264C418.649 44.1375 416.016 44.4755 413.383 44.4755C408.446 44.4755 405.616 41.569 405.616 36.77V25.6173C405.616 20.6831 408.446 17.8443 413.383 17.8443Z" fill="#414141"/>
<path d="M436.459 13.586C435.143 13.586 434.221 14.5323 434.221 15.8841V46.4356C434.221 47.7875 435.143 48.7337 436.459 48.7337C437.71 48.7337 438.697 47.7875 438.697 46.4356V15.8841C438.697 14.5323 437.71 13.586 436.459 13.586ZM436.459 1.48702C434.88 1.48702 433.563 2.77127 433.563 4.39347C433.563 5.94809 434.88 7.29992 436.459 7.29992C437.973 7.29992 439.29 5.94809 439.29 4.39347C439.29 2.77127 437.973 1.48702 436.459 1.48702Z" fill="#414141"/>
<path d="M458.805 13.586C450.971 13.586 446.035 18.4526 446.035 26.6312V35.7561C446.035 43.9347 451.037 48.7337 458.805 48.7337C466.769 48.7337 471.574 43.7995 471.574 35.7561V26.6312C471.574 18.5202 466.703 13.586 458.805 13.586ZM458.805 17.8443C463.741 17.8443 467.098 20.8859 467.098 26.2932V36.0941C467.098 41.4338 463.741 44.4755 458.805 44.4755C453.934 44.4755 450.511 41.4338 450.511 36.0941V26.2932C450.511 20.8859 453.934 17.8443 458.805 17.8443Z" fill="#414141"/>
<path d="M161 69.3602C161 63.4421 165.953 58.6445 172.062 58.6445H273.837C279.947 58.6445 284.899 63.4421 284.899 69.3602V87.5767C284.899 93.4948 279.947 98.2923 273.837 98.2923H172.062C165.953 98.2923 161 93.4948 161 87.5767V69.3602Z" fill="#414141"/>
<path d="M180.796 65.2529C175.923 65.2529 172.601 67.9291 172.601 72.0717C172.601 75.4811 174.668 77.3874 177.252 78.5972L181.755 80.6868C183.97 81.7499 185.114 82.6298 185.114 84.6094C185.114 86.8823 183.269 88.0921 180.611 88.0921C178.692 88.0921 177.289 87.6522 175.997 87.1023C175.185 86.7724 174.853 86.6624 174.336 86.6624C173.303 86.6624 172.564 87.3956 172.564 88.4954C172.564 89.2652 172.934 89.8885 173.746 90.2551C175.739 91.1716 177.99 91.6848 180.611 91.6848C185.409 91.6848 189.027 88.9353 189.027 84.4994C189.027 80.2469 186.332 78.5972 183.859 77.4607L179.541 75.4811C177.437 74.5279 176.477 73.6847 176.477 71.9251C176.477 69.9454 178.47 68.8456 180.574 68.8456C182.346 68.8456 183.453 69.0656 185.003 69.6888C185.631 69.9454 186.037 70.1287 186.627 70.1287C187.587 70.1287 188.325 69.3589 188.325 68.369C188.325 67.5625 187.993 67.0126 187.218 66.6093C185.409 65.7295 183.379 65.2529 180.796 65.2529Z" fill="white"/>
<path d="M201.923 65.2529C196.423 65.2529 192.621 68.5523 192.621 74.3446V82.5931C192.621 88.3121 196.386 91.6848 201.923 91.6848C203.953 91.6848 206.168 91.2815 207.902 90.0718C208.53 89.6318 208.825 89.1553 208.825 88.4587C208.825 87.4322 207.939 86.6624 207.017 86.6624C206.611 86.6624 206.241 86.7724 205.577 87.139C204.47 87.7622 203.289 88.0921 201.923 88.0921C198.601 88.0921 196.534 86.1125 196.534 82.8497V74.088C196.534 70.8253 198.564 68.8456 201.923 68.8456C203.362 68.8456 204.47 69.1389 205.835 69.8721C206.205 70.092 206.574 70.2387 207.017 70.2387C208.087 70.2387 208.825 69.3589 208.825 68.479C208.825 67.7091 208.419 67.1226 207.533 66.646C205.872 65.7295 204.138 65.2529 201.923 65.2529Z" fill="white"/>
<path d="M220.976 65.2529C220.127 65.2529 219.278 65.7662 218.945 66.646L211.12 89.0819C211.01 89.4119 210.973 89.6685 210.973 89.8518C210.973 90.9149 211.785 91.6848 212.892 91.6848C213.667 91.6848 214.442 91.2449 214.701 90.4384L216.362 85.3426H225.589L227.25 90.4384C227.509 91.2449 228.284 91.6848 229.096 91.6848C230.203 91.6848 231.015 90.9149 231.015 89.8518C231.015 89.6685 230.978 89.4119 230.868 89.0819L223.006 66.646C222.71 65.7662 221.861 65.2529 220.976 65.2529ZM220.976 71.2285L224.445 81.8233H217.506L220.976 71.2285Z" fill="white"/>
<path d="M236.956 65.6195C235.665 65.6195 234.631 66.5727 234.631 67.8558V89.0819C234.631 90.365 235.665 91.3182 236.956 91.3182H241.939C248.288 91.3182 252.164 87.7622 252.164 81.3467V75.5911C252.164 69.0656 248.251 65.6195 241.939 65.6195H236.956ZM242.013 69.2855C245.963 69.2855 248.251 71.4851 248.251 75.5177V81.42C248.251 85.3793 246.036 87.6522 242.013 87.6522H238.507V69.2855H242.013Z" fill="white"/>
<path d="M264.122 65.2529C263.273 65.2529 262.424 65.7662 262.092 66.646L254.267 89.0819C254.156 89.4119 254.119 89.6685 254.119 89.8518C254.119 90.9149 254.931 91.6848 256.039 91.6848C256.814 91.6848 257.589 91.2449 257.847 90.4384L259.508 85.3426H268.736L270.397 90.4384C270.655 91.2449 271.431 91.6848 272.243 91.6848C273.35 91.6848 274.162 90.9149 274.162 89.8518C274.162 89.6685 274.125 89.4119 274.014 89.0819L266.152 66.646C265.857 65.7662 265.008 65.2529 264.122 65.2529ZM264.122 71.2285L267.592 81.8233H260.653L264.122 71.2285Z" fill="white"/>
<path d="M324.558 66.1816C323.573 66.1816 322.786 66.803 322.589 67.6185L318.218 85.7933L314.162 68.3564C313.847 66.9583 312.862 66.1816 311.523 66.1816C310.224 66.1816 309.2 66.9583 308.885 68.3564L304.868 85.7933L300.458 67.6185C300.261 66.803 299.473 66.1816 298.489 66.1816C297.347 66.1816 296.48 67.036 296.48 68.0457C296.48 68.3564 296.559 68.6671 296.638 69.0166L302.309 92.0457C302.624 93.4049 303.608 94.1816 304.908 94.1816C306.207 94.1816 307.192 93.4049 307.507 92.0069L311.523 74.8418L315.54 92.0069C315.855 93.4049 316.879 94.1816 318.178 94.1816C319.439 94.1816 320.423 93.4049 320.777 92.0457L326.448 69.0166C326.527 68.6671 326.606 68.3564 326.606 68.0457C326.606 67.036 325.7 66.1816 324.558 66.1816Z" fill="#E10040"/>
<path d="M337.61 66.1816C336.704 66.1816 335.798 66.7253 335.444 67.6574L327.095 91.4244C326.977 91.7739 326.938 92.0457 326.938 92.2399C326.938 93.3661 327.804 94.1816 328.986 94.1816C329.813 94.1816 330.639 93.7156 330.915 92.8613L332.687 87.4632H342.532L344.304 92.8613C344.58 93.7156 345.407 94.1816 346.273 94.1816C347.454 94.1816 348.321 93.3661 348.321 92.2399C348.321 92.0457 348.281 91.7739 348.163 91.4244L339.775 67.6574C339.46 66.7253 338.555 66.1816 337.61 66.1816ZM337.61 72.5117L341.311 83.735H333.908L337.61 72.5117Z" fill="#E10040"/>
<path d="M366.514 66.1816C365.49 66.1816 364.742 66.7253 364.466 67.6185L358.283 87.502L352.022 67.6185C351.746 66.7253 350.998 66.1816 350.014 66.1816C348.911 66.1816 347.966 67.0748 347.966 68.0846C347.966 68.4729 348.084 68.7836 348.202 69.2108L355.527 91.968C355.999 93.5214 356.984 94.1816 358.283 94.1816C359.544 94.1816 360.528 93.5214 361.001 91.968L368.325 69.2108C368.443 68.7836 368.561 68.5117 368.561 68.0846C368.561 67.0748 367.616 66.1816 366.514 66.1816Z" fill="#E10040"/>
<path d="M374.58 66.57C373.201 66.57 372.099 67.5797 372.099 68.9389V91.4244C372.099 92.7836 373.201 93.7933 374.58 93.7933H386.512C387.693 93.7933 388.48 92.9389 388.48 91.8127C388.48 90.7253 387.693 89.871 386.512 89.871H376.234V81.638H385.724C386.905 81.638 387.732 80.7836 387.732 79.6574C387.732 78.57 386.905 77.7156 385.724 77.7156H376.234V70.4923H386.236C387.417 70.4923 388.205 69.638 388.205 68.5117C388.205 67.4244 387.417 66.57 386.236 66.57H374.58Z" fill="#E10040"/>
<path d="M23.6802 52.7576L1.3939 35.1921C0.630248 34.5902 -0.390157 35.5235 0.152779 36.3273L30.1982 80.9609C31.4369 82.801 34.2286 82.5858 35.1659 80.578L38.3432 71.1265C39.1406 69.3086 41.5956 68.9737 42.858 70.5107L51.9442 81.5727C53.248 83.1601 53.2351 85.4414 51.9132 87.0141L46.2232 93.7841C44.8086 95.4671 46.0601 98.0183 48.2681 97.9526L86.6807 98C89.4261 98.0034 91.4757 95.4948 90.9038 92.8312L82.2556 52.5523C81.8921 50.8592 79.6691 50.409 78.6657 51.8253L72.5606 60.4432C71.2038 62.3584 68.5472 62.8361 66.5991 61.5153L35.3936 40.3584C34.1604 39.5223 32.4632 40.0808 31.9784 41.4824L27.9111 51.6384C27.2358 53.3243 25.112 53.8862 23.6802 52.7576Z" fill="url(#paint0_linear_1059_209)"/>
<path fill-rule="evenodd" clip-rule="evenodd" d="M137 4.73687C137 2.58384 135.513 1 133.337 1H57.6634C55.4868 1 54 2.58384 54 4.73687V29.6924C54 31.8455 55.4868 33.4293 57.6634 33.4293C59.84 33.4293 61.5555 31.8455 61.5555 29.6924V8.47374H129.444V90.5752H99.108C96.9314 90.5752 95.4446 92.1591 95.4446 94.3121C95.4446 96.4651 96.9314 98.1621 99.108 98.1621H133.337C135.513 98.1621 137 96.4651 137 94.3121V4.73687Z" fill="url(#paint1_linear_1059_209)"/>
<path d="M114.448 49.5828C116.624 49.5828 118.111 51.1667 118.111 53.3197C118.111 55.4727 116.624 57.0566 114.448 57.0566H99.108C96.9314 57.0566 95.4446 55.4727 95.4446 53.3197C95.4446 51.1667 96.9314 49.5828 99.108 49.5828H114.448Z" fill="#414141"/>
<path d="M76.6666 41.996C74.49 41.996 73.0032 40.5253 73.0032 38.3722C73.0032 36.2192 74.49 34.6354 76.6666 34.6354H114.444C116.621 34.6354 118.108 36.2192 118.108 38.3722C118.108 40.5253 116.621 41.996 114.444 41.996H76.6666Z" fill="#414141"/>
<path d="M76.6666 27.1581C74.49 27.1581 72.8888 25.5742 72.8888 23.4212C72.8888 21.2682 74.49 19.5712 76.6666 19.5712H114.444C116.621 19.5712 118.108 21.2682 118.108 23.4212C118.108 25.5742 116.621 27.1581 114.444 27.1581H76.6666Z" fill="#414141"/>
<defs>
<linearGradient id="paint0_linear_1059_209" x1="87.0438" y1="91.8263" x2="2.96977" y2="37.2663" gradientUnits="userSpaceOnUse">
<stop stop-color="#E40040"/>
<stop offset="1" stop-color="#A00E3F"/>
</linearGradient>
<linearGradient id="paint1_linear_1059_209" x1="95.5" y1="1" x2="95.5" y2="98.1621" gradientUnits="userSpaceOnUse">
<stop stop-color="#A70C3F"/>
<stop offset="1" stop-color="#E40040"/>
</linearGradient>
</defs>
</svg>
