{
	"info": {
		"_postman_id": "d9c5645c-5da7-410a-9dba-26cf57ed6be8",
		"name": "Microservice",
		"schema": "https://schema.getpostman.com/json/collection/v2.1.0/collection.json"
	},
	"item": [
		{
			"name": "Auth",
			"item": [
				{
					"name": "Login",
					"event": [
						{
							"listen": "test",
							"script": {
								"id": "b50533f6-717c-4ffe-a97a-04969247f2b9",
								"exec": [
									"var data = JSON.parse(responseBody);",
									"",
									"tests[\"response status is: \" + responseCode.code] = true;",
									"",
									"if(responseCode.code == 200){",
									"    postman.setEnvironmentVariable(\"micro_vcode\", data.data.verification_code.code);",
									"}"
								],
								"type": "text/javascript"
							}
						}
					],
					"request": {
						"method": "POST",
						"header": [
							{
								"key": "Content-Type",
								"name": "Content-Type",
								"value": "application/json",
								"type": "text"
							}
						],
						"body": {
							"mode": "raw",
							"raw": "{\n\t\"identity\": \"081353206485\"\n}"
						},
						"url": {
							"raw": "{{url}}/auth/login",
							"host": [
								"{{url}}"
							],
							"path": [
								"auth",
								"login"
							]
						}
					},
					"response": []
				},
				{
					"name": "Verify",
					"event": [
						{
							"listen": "test",
							"script": {
								"id": "87d54edd-251f-47ef-b18f-9b6a00aed8e5",
								"exec": [
									"var data = JSON.parse(responseBody);",
									"",
									"tests[\"response status is: \" + responseCode.code] = true;",
									"",
									"if(responseCode.code == 200){",
									"    postman.setEnvironmentVariable(\"micro_access_token\", data.data.access_token);",
									"    postman.setEnvironmentVariable(\"micro_refresh_token\", data.data.refresh_token);",
									"}"
								],
								"type": "text/javascript"
							}
						}
					],
					"request": {
						"method": "POST",
						"header": [
							{
								"key": "Content-Type",
								"name": "Content-Type",
								"type": "text",
								"value": "application/json"
							}
						],
						"body": {
							"mode": "raw",
							"raw": "{\n\t\"code\": \"{{micro_vcode}}\",\n \t\"passkey\": \"5856CY\"\n}"
						},
						"url": {
							"raw": "{{url}}/auth/verify",
							"host": [
								"{{url}}"
							],
							"path": [
								"auth",
								"verify"
							]
						}
					},
					"response": []
				},
				{
					"name": "Reverify",
					"request": {
						"method": "PUT",
						"header": [
							{
								"key": "Content-Type",
								"name": "Content-Type",
								"value": "application/json",
								"type": "text"
							}
						],
						"body": {
							"mode": "raw",
							"raw": "{\n\t\"code\": \"{{micro_vcode}}\"\n}"
						},
						"url": {
							"raw": "{{url}}/auth/reverify",
							"host": [
								"{{url}}"
							],
							"path": [
								"auth",
								"reverify"
							]
						}
					},
					"response": []
				},
				{
					"name": "Refresh Token",
					"request": {
						"auth": {
							"type": "bearer",
							"bearer": [
								{
									"key": "token",
									"value": "{{micro_access_token}}",
									"type": "string"
								}
							]
						},
						"method": "PUT",
						"header": [],
						"url": {
							"raw": "{{url}}/auth/refresh",
							"host": [
								"{{url}}"
							],
							"path": [
								"auth",
								"refresh"
							]
						}
					},
					"response": []
				},
				{
					"name": "Revoke Access Token",
					"request": {
						"auth": {
							"type": "bearer",
							"bearer": [
								{
									"key": "token",
									"value": "{{micro_access_token}}",
									"type": "string"
								}
							]
						},
						"method": "DELETE",
						"header": [],
						"url": {
							"raw": "{{url}}/auth/access/revoke",
							"host": [
								"{{url}}"
							],
							"path": [
								"auth",
								"access",
								"revoke"
							]
						}
					},
					"response": []
				},
				{
					"name": "Revoke Refresh Token",
					"request": {
						"auth": {
							"type": "bearer",
							"bearer": [
								{
									"key": "token",
									"value": "{{micro_refresh_token}}",
									"type": "string"
								}
							]
						},
						"method": "DELETE",
						"header": [],
						"url": {
							"raw": "{{url}}/auth/refresh/revoke",
							"host": [
								"{{url}}"
							],
							"path": [
								"auth",
								"refresh",
								"revoke"
							]
						}
					},
					"response": []
				}
			]
		},
		{
			"name": "User",
			"item": [
				{
					"name": "All Users",
					"request": {
						"auth": {
							"type": "bearer",
							"bearer": [
								{
									"key": "token",
									"value": "{{micro_access_token}}",
									"type": "string"
								}
							]
						},
						"method": "GET",
						"header": [
							{
								"key": "Content-Type",
								"name": "Content-Type",
								"value": "application/json",
								"type": "text"
							}
						],
						"url": {
							"raw": "{{url}}/users?exclude=role.permissions",
							"host": [
								"{{url}}"
							],
							"path": [
								"users"
							],
							"query": [
								{
									"key": "exclude",
									"value": "role.permissions"
								}
							]
						}
					},
					"response": []
				},
				{
					"name": "Add User",
					"request": {
						"auth": {
							"type": "bearer",
							"bearer": [
								{
									"key": "token",
									"value": "{{micro_access_token}}",
									"type": "string"
								}
							]
						},
						"method": "POST",
						"header": [
							{
								"key": "Content-Type",
								"name": "Content-Type",
								"value": "application/json",
								"type": "text"
							}
						],
						"body": {
							"mode": "raw",
							"raw": "{\n\t\"fullname\": \"Mas Jono Sukerto\",\n\t\"phone\": \"0812345678990\",\n\t\"email\": \"masjonosukerto@gmail.com\",\n\t\"status\": \"verified\",\n\t\"role\": 1788827948\n}"
						},
						"url": {
							"raw": "{{url}}/users",
							"host": [
								"{{url}}"
							],
							"path": [
								"users"
							]
						}
					},
					"response": []
				},
				{
					"name": "View User",
					"request": {
						"auth": {
							"type": "bearer",
							"bearer": [
								{
									"key": "token",
									"value": "{{micro_access_token}}",
									"type": "string"
								}
							]
						},
						"method": "GET",
						"header": [],
						"url": {
							"raw": "{{url}}/users/573852158?exclude=role.permissions",
							"host": [
								"{{url}}"
							],
							"path": [
								"users",
								"573852158"
							],
							"query": [
								{
									"key": "exclude",
									"value": "role.permissions"
								}
							]
						}
					},
					"response": []
				},
				{
					"name": "Edit User",
					"request": {
						"auth": {
							"type": "bearer",
							"bearer": [
								{
									"key": "token",
									"value": "{{micro_access_token}}",
									"type": "string"
								}
							]
						},
						"method": "PUT",
						"header": [
							{
								"key": "Content-Type",
								"name": "Content-Type",
								"value": "application/json",
								"type": "text"
							}
						],
						"body": {
							"mode": "raw",
							"raw": "{\n\t\"fullname\": \"Erwin\"\n}"
						},
						"url": {
							"raw": "{{url}}/users/573852158?exclude=role.permissions",
							"host": [
								"{{url}}"
							],
							"path": [
								"users",
								"573852158"
							],
							"query": [
								{
									"key": "exclude",
									"value": "role.permissions"
								}
							]
						}
					},
					"response": []
				},
				{
					"name": "Delete User",
					"request": {
						"auth": {
							"type": "bearer",
							"bearer": [
								{
									"key": "token",
									"value": "{{micro_access_token}}",
									"type": "string"
								}
							]
						},
						"method": "DELETE",
						"header": [],
						"url": {
							"raw": "{{url}}/users/480213004?exclude=role.permissions",
							"host": [
								"{{url}}"
							],
							"path": [
								"users",
								"480213004"
							],
							"query": [
								{
									"key": "exclude",
									"value": "role.permissions"
								}
							]
						}
					},
					"response": []
				},
				{
					"name": "Search Elastic",
					"request": {
						"auth": {
							"type": "bearer",
							"bearer": [
								{
									"key": "token",
									"value": "{{micro_access_token}}",
									"type": "string"
								}
							]
						},
						"method": "GET",
						"header": [],
						"url": {
							"raw": "{{url}}/users/search?q=win&exclude=role.permissions",
							"host": [
								"{{url}}"
							],
							"path": [
								"users",
								"search"
							],
							"query": [
								{
									"key": "q",
									"value": "win"
								},
								{
									"key": "exclude",
									"value": "role.permissions"
								}
							]
						}
					},
					"response": []
				}
			]
		}
	]
}