{
  "greenButton": "[type='button']",
  "itemField": "[data-test-id='item']",
  "arrowMenu": "[data-test-id='admin-menu-button']",
  "adminDropDownProfile": "[data-test-id='admin-dropdown-profile']",
  "notConfirmedField": "[data-test-id='row']",
  "changePassword": "[href='/profile/change-password']"
}