{
  "firstName": "Author",
  "lastName": "Author",
  "affiliation": "Automatic checks",
  "email": "author1@thinslices.com",
  "username": "author1@thinslices.com",
  "country": "Australia",
  "title": "Professor",
  "roleOption": 0
}
