
total 32
drwxr-xr-x 5 batoi batoi 4096 oct  6 23:18 .
drwxrwxr-x 6 batoi batoi 4096 oct  6 23:24 ..
drwxr-xr-x 2 batoi batoi 4096 oct  6 23:27 .idea
-rw-r--r-- 1 batoi batoi  404 oct  6 23:19 output.txt
-rw-r--r-- 1 batoi batoi 1675 oct  3 18:16 pom.xml
-rw-rw-r-- 1 batoi batoi   35 sep 29 15:24 README.md
drwxr-xr-x 4 batoi batoi 4096 sep 29 15:32 src
drwxr-xr-x 6 batoi batoi 4096 sep 29 15:45 target