%YAML 1.1
%TAG !u! tag:unity3d.com,2011:
--- !u!162 &1
EditorUserSettings:
  m_ObjectHideFlags: 0
  serializedVersion: 4
  m_ConfigSettings:
    RecentlyUsedSceneGuid-0:
      value: 0652010354045b025d5d547641270c14444e40292d7923602e284b35e0e3656f
      flags: 0
    RecentlyUsedSceneGuid-1:
      value: 5a0951035203510c5c570a7316715e164e4f1a2b787973347d2a4c61b7e16d60
      flags: 0
    RecentlyUsedSceneGuid-2:
      value: 060907045c050f02085b5b7a407a5d48454e4a297f2c7662792d4461b2e5356a
      flags: 0
    RecentlyUsedSceneGuid-3:
      value: 0152550400020d0b5c5f5f2144770c114f4f487a7f7f20657d2d4432e4e16168
      flags: 0
    RecentlyUsedSceneGuid-4:
      value: 0600520357035b5d0c575c2615770e12424f1b7d78297636782f4932bbe46568
      flags: 0
    RecentlyUsedSceneGuid-5:
      value: 5a555551510d0f095a5b5876487709114f4f497d782c22347b7f1e61b6e26139
      flags: 0
    RecentlyUsedSceneGuid-6:
      value: 0509005654540f5d58565d75437b5c434f16412e7c7171352f284a66bab76739
      flags: 0
    RecentlyUsedSceneGuid-7:
      value: 02550d04520c580b540a087544275d451415412e7a707e677b7b186bb5b2636a
      flags: 0
    RecentlyUsedSceneGuid-8:
      value: 515250075c0c595e5f5a5e71122159444e4e4a2f7a7d7f602f284d66b4b76661
      flags: 0
    RecentlyUsedScenePath-0:
      value: 22424703114646680e0b0227036c6c111b07142f1f2b233e2867083debf42d
      flags: 0
    vcSharedLogLevel:
      value: 0d5e400f0650
      flags: 0
  m_VCAutomaticAdd: 1
  m_VCDebugCom: 0
  m_VCDebugCmd: 0
  m_VCDebugOut: 0
  m_SemanticMergeMode: 2
  m_DesiredImportWorkerCount: 2
  m_StandbyImportWorkerCount: 2
  m_IdleImportWorkerShutdownDelay: 60000
  m_VCShowFailedCheckout: 1
  m_VCOverwriteFailedCheckoutAssets: 1
  m_VCProjectOverlayIcons: 1
  m_VCHierarchyOverlayIcons: 1
  m_VCOtherOverlayIcons: 1
  m_VCAllowAsyncUpdate: 1
  m_ArtifactGarbageCollection: 1
