%YAML 1.1
%TAG !u! tag:unity3d.com,2011:
--- !u!114 &11400000
MonoBehaviour:
  m_ObjectHideFlags: 0
  m_CorrespondingSourceObject: {fileID: 0}
  m_PrefabInstance: {fileID: 0}
  m_PrefabAsset: {fileID: 0}
  m_GameObject: {fileID: 0}
  m_Enabled: 1
  m_EditorHideFlags: 0
  m_Script: {fileID: 11500000, guid: 4690b0cad78739d598fda9bb71f0baac, type: 3}
  m_Name: Vendor
  m_EditorClassIdentifier: 
  fullname: Vendor
  portrait: {fileID: 1404248521807868572, guid: ae2e59adf58c94839a4a49d1a41c5920, type: 3}
