%YAML 1.1
%TAG !u! tag:unity3d.com,2011:
--- !u!114 &11400000
MonoBehaviour:
  m_ObjectHideFlags: 0
  m_CorrespondingSourceObject: {fileID: 0}
  m_PrefabInstance: {fileID: 0}
  m_PrefabAsset: {fileID: 0}
  m_GameObject: {fileID: 0}
  m_Enabled: 1
  m_EditorHideFlags: 0
  m_Script: {fileID: 11500000, guid: 7186c979e879bfdd2805271edbbb6b20, type: 3}
  m_Name: PreferencesSystem
  m_EditorClassIdentifier: 
  volume: 0
  mixer: {fileID: 24100000, guid: 899edb7938909d6b5a813086d107eb65, type: 2}
