%YAML 1.1
%TAG !u! tag:unity3d.com,2011:
--- !u!114 &11400000
MonoBehaviour:
  m_ObjectHideFlags: 0
  m_CorrespondingSourceObject: {fileID: 0}
  m_PrefabInstance: {fileID: 0}
  m_PrefabAsset: {fileID: 0}
  m_GameObject: {fileID: 0}
  m_Enabled: 1
  m_EditorHideFlags: 0
  m_Script: {fileID: 11500000, guid: 3b0cb8ee81ccf1b7ebeaa5eeb4bdb216, type: 3}
  m_Name: SaveSystem
  m_EditorClassIdentifier: 
  saveFilename: savefile.sav
  backupSaveFilename: savefile.sav.bak
  playerInventory: {fileID: 11400000, guid: 9113fd163497d0401aecc84ebb64236c, type: 2}
  saveData:
    gold: 0
    weapons: []
    consumables: []
