INDEX VERSION 1.131+C:\ws-exp\cuentas\.metadata\.plugins\org.eclipse.jdt.core
2688783450.index
1063643129.index
323171674.index
2091400512.index
3390545763.index
1408211338.index
2509800163.index
2908836391.index
1541261839.index
2056805366.index
289811613.index
2583828804.index
2365264807.index
863122030.index
61436394.index
3767767424.index
3065053440.index
3677362244.index
1310578448.index
2602171745.index
767842954.index
2495567800.index
575557243.index
664140773.index
1470073441.index
3894941320.index
1971490727.index
4265421893.index
2951431056.index
1101913381.index
3786438684.index
