module gitlab.com/cindrmons-cradle/sandbox/go/studybuddy

go 1.18

require github.com/spf13/cobra v1.4.0

require (
	github.com/chzyer/readline v0.0.0-20180603132655-2972be24d48e // indirect
	github.com/inconshreveable/mousetrap v1.0.0 // indirect
	github.com/manifoldco/promptui v0.9.0 // indirect
	github.com/mattn/go-sqlite3 v1.14.13 // indirect
	github.com/spf13/pflag v1.0.5 // indirect
	golang.org/x/sys v0.0.0-20181122145206-62eef0e2fa9b // indirect
)
