[
  {
    "type": "2B11 mortar",
    "name": "2B11 mortar",
    "category": "Artillery"
  },
  {
    "type": "SAU Gvozdika",
    "name": "SPH 2S1 Gvozdika",
    "category": "Artillery"
  },
  {
    "type": "SAU Msta",
    "name": "SPH 2S19 Msta",
    "category": "Artillery"
  },
  {
    "type": "SAU Akatsia",
    "name": "SPH 2S3 Akatsia",
    "category": "Artillery"
  },
  {
    "type": "SAU 2-C9",
    "name": "SPH 2S9 Nona",
    "category": "Artillery"
  },
  {
    "type": "M-109",
    "name": "SPH M109 Paladin",
    "category": "Artillery"
  },
  {
    "type": "SpGH_Dana",
    "name": "SpGH Dana",
    "category": "Artillery"
  },
  {
    "type": "AAV7",
    "name": "APC AAV-7",
    "category": "Armor"
  },
  {
    "type": "BMD-1",
    "name": "IFV BMD-1",
    "category": "Armor"
  },
  {
    "type": "BMP-1",
    "name": "IFV BMP-1",
    "category": "Armor"
  },
  {
    "type": "BMP-2",
    "name": "IFV BMP-2",
    "category": "Armor"
  },
  {
    "type": "BMP-3",
    "name": "IFV BMP-3",
    "category": "Armor"
  },
  {
    "type": "Boman",
    "name": "ARV MTLB-U BOMAN",
    "category": "Armor"
  },
  {
    "type": "BRDM-2",
    "name": "ARV BRDM-2",
    "category": "Armor"
  },
  {
    "type": "BTR-80",
    "name": "APC BTR-80",
    "category": "Armor"
  },
  {
    "type": "BTR_D",
    "name": "ARV BTR-RD",
    "category": "Armor"
  },
  {
    "type": "Bunker",
    "name": "Bunker",
    "category": "Fortification"
  },
  {
    "type": "Cobra",
    "name": "APC Cobra",
    "category": "Armor"
  },
  {
    "type": "LAV-25",
    "name": "APC LAV-25",
    "category": "Armor"
  },
  {
    "type": "M1043 HMMWV Armament",
    "name": "APC M1043 HMMWV Armament",
    "category": "Armor"
  },
  {
    "type": "M1045 HMMWV TOW",
    "name": "ATGM M1045 HMMWV TOW",
    "category": "Armor"
  },
  {
    "type": "M1126 Stryker ICV",
    "name": "APC M1126 Stryker ICV",
    "category": "Armor"
  },
  {
    "type": "M-113",
    "name": "APC M113",
    "category": "Armor"
  },
  {
    "type": "M1134 Stryker ATGM",
    "name": "ATGM M1134 Stryker",
    "category": "Armor"
  },
  {
    "type": "M-2 Bradley",
    "name": "IFV M2A2 Bradley",
    "category": "Armor"
  },
  {
    "type": "Marder",
    "name": "IFV Marder",
    "category": "Armor"
  },
  {
    "type": "MCV-80",
    "name": "IFV MCV-80",
    "category": "Armor"
  },
  {
    "type": "MLRS FDDM",
    "name": "MLRS FDDM",
    "category": "Artillery"
  },
  {
    "type": "MTLB",
    "name": "APC MTLB",
    "category": "Armor"
  },
  {
    "type": "Paratrooper RPG-16",
    "name": "Infantry Paratrooper RPG-16",
    "category": "Infantry"
  },
  {
    "type": "Paratrooper AKS-74",
    "name": "Infantry Paratrooper AKS",
    "category": "Infantry"
  },
  {
    "type": "Sandbox",
    "name": "Sandbox",
    "category": "Fortification"
  },
  {
    "type": "Soldier AK",
    "name": "Infantry Soldier AK",
    "category": "Infantry"
  },
  {
    "type": "Infantry AK Ins",
    "name": "Infantry Soldier Insurgents",
    "category": "Infantry"
  },
  {
    "type": "Infantry AK",
    "name": "Infantry Soldier Rus",
    "category": "Infantry"
  },
  {
    "type": "Soldier M249",
    "name": "Infantry Soldier M249",
    "category": "Infantry"
  },
  {
    "type": "Soldier M4",
    "name": "Infantry Soldier M4",
    "category": "Infantry"
  },
  {
    "type": "Soldier M4 GRG",
    "name": "Georgian soldier with M4",
    "category": "Infantry"
  },
  {
    "type": "Soldier RPG",
    "name": "Infantry Soldier RPG",
    "category": "Infantry"
  },
  {
    "type": "Technician",
    "name": "Technician",
    "category": "Infantry"
  },
  {
    "type": "TPZ",
    "name": "TPz Fuchs",
    "category": "Armor"
  },
  {
    "type": "Grad-URAL",
    "name": "MLRS BM-21 Grad",
    "category": "Artillery"
  },
  {
    "type": "Uragan_BM-27",
    "name": "MLRS 9K57 Uragan BM-27",
    "category": "Artillery"
  },
  {
    "type": "Smerch",
    "name": "MLRS 9A52 Smerch",
    "category": "Artillery"
  },
  {
    "type": "MLRS",
    "name": "MLRS M270",
    "category": "Artillery"
  },
  {
    "type": "2S6 Tunguska",
    "name": "SAM SA-19 Tunguska 2S6",
    "category": "Air Defence"
  },
  {
    "type": "Kub 2P25 ln",
    "name": "SAM SA-6 Kub LN 2P25",
    "category": "Air Defence"
  },
  {
    "type": "5p73 s-125 ln",
    "name": "SAM SA-3 S-125 LN 5P73",
    "category": "Air Defence"
  },
  {
    "type": "S-300PS 5P85C ln",
    "name": "SAM SA-10 S-300PS LN 5P85C",
    "category": "Air Defence"
  },
  {
    "type": "S-300PS 5P85D ln",
    "name": "SAM SA-10 S-300PS LN 5P85D",
    "category": "Air Defence"
  },
  {
    "type": "SA-11 Buk LN 9A310M1",
    "name": "SAM SA-11 Buk LN 9A310M1",
    "category": "Air Defence"
  },
  {
    "type": "Osa 9A33 ln",
    "name": "SAM SA-8 Osa 9A33",
    "category": "Air Defence"
  },
  {
    "type": "Tor 9A331",
    "name": "SAM SA-15 Tor 9A331",
    "category": "Air Defence"
  },
  {
    "type": "Strela-10M3",
    "name": "SAM SA-13 Strela-10M3 9A35M3",
    "category": "Air Defence"
  },
  {
    "type": "Strela-1 9P31",
    "name": "SAM SA-9 Strela-1 9P31",
    "category": "Air Defence"
  },
  {
    "type": "SA-11 Buk CC 9S470M1",
    "name": "SAM SA-11 Buk CC 9S470M1",
    "category": "Air Defence"
  },
  {
    "type": "SA-8 Osa LD 9T217",
    "name": "SAM SA-8 Osa LD 9T217",
    "category": "Air Defence"
  },
  {
    "type": "Patriot AMG",
    "name": "SAM Patriot AMG AN/MRC-137",
    "category": "Air Defence"
  },
  {
    "type": "Patriot ECS",
    "name": "SAM Patriot ECS AN/MSQ-104",
    "category": "Air Defence"
  },
  {
    "type": "Gepard",
    "name": "AAA Gepard",
    "category": "Air Defence"
  },
  {
    "type": "Hawk pcp",
    "name": "SAM Hawk PCP",
    "category": "Air Defence"
  },
  {
    "type": "SA-18 Igla manpad",
    "name": "SAM SA-18 Igla manpad",
    "category": "Air Defence"
  },
  {
    "type": "SA-18 Igla comm",
    "name": "SAM SA-18 Igla comm",
    "category": "Air Defence"
  },
  {
    "type": "Igla manpad INS",
    "name": "SAM SA-18 Igla manpad",
    "category": "Air Defence"
  },
  {
    "type": "SA-18 Igla-S manpad",
    "name": "SAM SA-18 Igla-S manpad",
    "category": "Air Defence"
  },
  {
    "type": "SA-18 Igla-S comm",
    "name": "SAM SA-18 Igla-S comm",
    "category": "Air Defence"
  },
  {
    "type": "Vulcan",
    "name": "AAA Vulcan M163",
    "category": "Air Defence"
  },
  {
    "type": "Hawk ln",
    "name": "SAM Hawk LN M192",
    "category": "Air Defence"
  },
  {
    "type": "M48 Chaparral",
    "name": "SAM Chaparral M48",
    "category": "Air Defence"
  },
  {
    "type": "M6 Linebacker",
    "name": "SAM Linebacker M6",
    "category": "Air Defence"
  },
  {
    "type": "Patriot ln",
    "name": "SAM Patriot LN M901",
    "category": "Air Defence"
  },
  {
    "type": "M1097 Avenger",
    "name": "SAM Avenger M1097",
    "category": "Air Defence"
  },
  {
    "type": "Patriot EPP",
    "name": "SAM Patriot EPP-III",
    "category": "Air Defence"
  },
  {
    "type": "Patriot cp",
    "name": "SAM Patriot ICC",
    "category": "Air Defence"
  },
  {
    "type": "Roland ADS",
    "name": "SAM Roland ADS",
    "category": "Air Defence"
  },
  {
    "type": "S-300PS 54K6 cp",
    "name": "SAM SA-10 S-300PS CP 54K6",
    "category": "Air Defence"
  },
  {
    "type": "Stinger comm dsr",
    "name": "SAM Stinger comm dsr",
    "category": "Air Defence"
  },
  {
    "type": "Stinger comm",
    "name": "SAM Stinger comm",
    "category": "Air Defence"
  },
  {
    "type": "Soldier stinger",
    "name": "Stinger MANPADS",
    "category": "Air Defence"
  },
  {
    "type": "ZSU-23-4 Shilka",
    "name": "AAA ZSU-23-4 Shilka",
    "category": "Air Defence"
  },
  {
    "type": "ZU-23 Emplacement Closed",
    "name": "AAA ZU-23 Emplacement Closed",
    "category": "Air Defence"
  },
  {
    "type": "ZU-23 Emplacement",
    "name": "AAA ZU-23 Emplacement",
    "category": "Air Defence"
  },
  {
    "type": "ZU-23 Closed Insurgent",
    "name": "AAA ZU-23 Insurgent Closed",
    "category": "Air Defence"
  },
  {
    "type": "Ural-375 ZU-23 Insurgent",
    "name": "AAA ZU-23 Insurgent on Ural-375",
    "category": "Air Defence"
  },
  {
    "type": "ZU-23 Insurgent",
    "name": "AAA ZU-23 Insurgent",
    "category": "Air Defence"
  },
  {
    "type": "Ural-375 ZU-23",
    "name": "AAA ZU-23 on Ural-375",
    "category": "Air Defence"
  },
  {
    "type": "1L13 EWR",
    "name": "EWR 1L13",
    "category": "Air Defence"
  },
  {
    "type": "Kub 1S91 str",
    "name": "SAM SA-6 Kub STR 9S91",
    "category": "Air Defence"
  },
  {
    "type": "S-300PS 40B6M tr",
    "name": "SAM SA-10 S-300PS TR 30N6",
    "category": "Air Defence"
  },
  {
    "type": "S-300PS 40B6MD sr",
    "name": "SAM SA-10 S-300PS SR 5N66M",
    "category": "Air Defence"
  },
  {
    "type": "55G6 EWR",
    "name": "EWR 55G6",
    "category": "Air Defence"
  },
  {
    "type": "S-300PS 64H6E sr",
    "name": "SAM SA-10 S-300PS SR 64H6E",
    "category": "Air Defence"
  },
  {
    "type": "SA-11 Buk SR 9S18M1",
    "name": "SAM SA-11 Buk SR 9S18M1",
    "category": "Air Defence"
  },
  {
    "type": "Dog Ear radar",
    "name": "CP 9S80M1 Sborka",
    "category": "Air Defence"
  },
  {
    "type": "Hawk tr",
    "name": "SAM Hawk TR AN/MPQ-46",
    "category": "Air Defence"
  },
  {
    "type": "Hawk sr",
    "name": "SAM Hawk SR AN/MPQ-50",
    "category": "Air Defence"
  },
  {
    "type": "Patriot str",
    "name": "SAM Patriot STR AN/MPQ-53",
    "category": "Air Defence"
  },
  {
    "type": "Hawk cwar",
    "name": "SAM Hawk CWAR AN/MPQ-55",
    "category": "Air Defence"
  },
  {
    "type": "p-19 s-125 sr",
    "name": "SAM SA-3 S-125 SR P-19",
    "category": "Air Defence"
  },
  {
    "type": "Roland Radar",
    "name": "SAM Roland rdr",
    "category": "Air Defence"
  },
  {
    "type": "snr s-125 tr",
    "name": "SAM SA-3 S-125 TR SNR",
    "category": "Air Defence"
  },
  {
    "type": "house1arm",
    "name": "Barracks armed",
    "category": "Fortification"
  },
  {
    "type": "house2arm",
    "name": "Watch tower armed",
    "category": "Fortification"
  },
  {
    "type": "outpost_road",
    "name": "Road outpost",
    "category": "Fortification"
  },
  {
    "type": "outpost",
    "name": "Outpost",
    "category": "Fortification"
  },
  {
    "type": "houseA_arm",
    "name": "Armed house",
    "category": "Fortification"
  },
  {
    "type": "Challenger2",
    "name": "MBT Challenger II",
    "category": "Armor"
  },
  {
    "type": "Leclerc",
    "name": "MBT Leclerc",
    "category": "Armor"
  },
  {
    "type": "Leopard1A3",
    "name": "MBT Leopard1A3",
    "category": "Armor"
  },
  {
    "type": "Leopard-2",
    "name": "MBT Leopard-2",
    "category": "Armor"
  },
  {
    "type": "M-60",
    "name": "MBT M60A3",
    "category": "Armor"
  },
  {
    "type": "M1128 Stryker MGS",
    "name": "SPG M1128 Stryker MGS",
    "category": "Armor"
  },
  {
    "type": "M-1 Abrams",
    "name": "MBT M1A2 Abrams",
    "category": "Armor"
  },
  {
    "type": "Merkava_Mk4",
    "name": "MBT Merkava Mk. 4",
    "category": "Armor"
  },
  {
    "type": "T-55",
    "name": "MBT T-55",
    "category": "Armor"
  },
  {
    "type": "T-72B",
    "name": "MBT T-72B",
    "category": "Armor"
  },
  {
    "type": "T-80UD",
    "name": "MBT T-80U",
    "category": "Armor"
  },
  {
    "type": "T-90",
    "name": "MBT T-90",
    "category": "Armor"
  },
  {
    "type": "TrainTest",
    "name": "TrainTest_loc",
    "category": "Train"
  },
  {
    "type": "Ural-4320 APA-5D",
    "name": "GPU APA-5D on Ural-4320",
    "category": "Unarmed"
  },
  {
    "type": "ATMZ-5",
    "name": "Fuel Truck ATMZ-5",
    "category": "Unarmed"
  },
  {
    "type": "ATZ-10",
    "name": "Fuel Truck ATZ-10",
    "category": "Unarmed"
  },
  {
    "type": "GAZ-3307",
    "name": "Transport GAZ-3307",
    "category": "Unarmed"
  },
  {
    "type": "GAZ-3308",
    "name": "Transport GAZ-3308",
    "category": "Unarmed"
  },
  {
    "type": "GAZ-66",
    "name": "Transport GAZ-66",
    "category": "Unarmed"
  },
  {
    "type": "M978 HEMTT Tanker",
    "name": "Tanker M978 HEMTT",
    "category": "Unarmed"
  },
  {
    "type": "HEMTT TFFT",
    "name": "HEMTT TFFT",
    "category": "Unarmed"
  },
  {
    "type": "IKARUS Bus",
    "name": "Transport IKARUS-280",
    "category": "Unarmed"
  },
  {
    "type": "KAMAZ Truck",
    "name": "Transport KAMAZ-43101",
    "category": "Unarmed"
  },
  {
    "type": "KrAZ6322",
    "name": "Transport KrAZ-6322",
    "category": "Unarmed"
  },
  {
    "type": "LAZ Bus",
    "name": "Transport LAZ-695",
    "category": "Unarmed"
  },
  {
    "type": "Hummer",
    "name": "APC M1025 HMMWV",
    "category": "Unarmed"
  },
  {
    "type": "M 818",
    "name": "Transport M818",
    "category": "Unarmed"
  },
  {
    "type": "MAZ-6303",
    "name": "Transport MAZ-6303",
    "category": "Unarmed"
  },
  {
    "type": "Predator GCS",
    "name": "CP Predator GCS",
    "category": "Unarmed"
  },
  {
    "type": "Predator TrojanSpirit",
    "name": "CP Predator TrojanSpirit",
    "category": "Unarmed"
  },
  {
    "type": "Suidae",
    "name": "Suidae",
    "category": "Unarmed"
  },
  {
    "type": "Tigr_233036",
    "name": "APC Tigr 233036",
    "category": "Unarmed"
  },
  {
    "type": "Trolley bus",
    "name": "Transport ZIU-9",
    "category": "Unarmed"
  },
  {
    "type": "UAZ-469",
    "name": "Transport UAZ-469",
    "category": "Unarmed"
  },
  {
    "type": "Ural ATsP-6",
    "name": "Transport fire-Engine Ural ATsP-6",
    "category": "Unarmed"
  },
  {
    "type": "Ural-375 PBU",
    "name": "CP Ural-375 PBU",
    "category": "Unarmed"
  },
  {
    "type": "Ural-375",
    "name": "Transport Ural-375",
    "category": "Unarmed"
  },
  {
    "type": "Ural-4320-31",
    "name": "Transport Ural-4320-31 Armored",
    "category": "Unarmed"
  },
  {
    "type": "Ural-4320T",
    "name": "Transport Ural-4320T",
    "category": "Unarmed"
  },
  {
    "type": "VAZ Car",
    "name": "Transport VAZ-2109",
    "category": "Unarmed"
  },
  {
    "type": "ZiL-131 APA-80",
    "name": "GPU APA-80 on ZiL-131",
    "category": "Unarmed"
  },
  {
    "type": "SKP-11",
    "name": "CP SKP-11 Mobile Command Post",
    "category": "Unarmed"
  },
  {
    "type": "ZIL-131 KUNG",
    "name": "Transport ZIL-131 KUNG",
    "category": "Unarmed"
  },
  {
    "type": "ZIL-4331",
    "name": "Transport ZIL-4331",
    "category": "Unarmed"
  }
]