{
  "osx" : {
    "title": "Fleep",
    "icon": "fleep.icns",
    "icon-size": 256,
    "contents": [
      { "x": 355, "y": 125, "type": "link", "path": "/Applications" },
      { "x": 155, "y": 125, "type": "file" }
    ]
  },
  "win" : {
    "title" : "fleep",
    "icon" : "fleep.png"
  }
}
