@startuml

interface "PACT B2B API"

node "REST" {
    package "API" {
        interface "REST" as REST_API

        REST_API -- [Operation Controller]
        REST_API -- [Voting Card Controller]
        REST_API -- [User Controller]
        REST_API -- [Version Controller]

        [Version Controller] <- [VersionVo]
    }

    package "B2B" {
        interface "REST" as REST_B2B
    }

    package "Shared" {
        [ConnectedUser]
        [User Controller] <- [ConnectedUser]
    }
}

node "Services" {
    package "Operation" {
        [Operation Controller] ..> [Operation Service] : use
        [OperationVo] -> [Operation Service]
    }

    package "Voting Card" {
        [Voting Card Controller] ..> [Voting Card Service] : use
        [Voting Card Service] <- [VotingCardVo]
    }

    package "Notification" {
        [Operation Initializer] ..> [PACT B2B API] : use
    }
}

node "Repositories" {
    [Operation Service] ..> [Operation Repository] : use
    [Voting Card Service] ..> [Voting Card Repository] : use
    [Operation Initializer] ..> [Operation Repository] : use
    [Operation Initializer] ..> [Voting Card Repository] : use

}

database "VRUM Database" {
    [Operation Repository] -- [Oracle]
    [Voting Card Repository] -- [Oracle]
}

@enduml
