@startuml

together {

    package PACT as PACT_package {
        [PACT]
        interface "<<REST>>\nOperation\nconfiguration" as op_c
        interface "<<REST>>\nVoting site\nconfiguration" as vp_c
        interface "<<REST>>\nVoters" as vm_c
        interface "<<Exchange>>\nvote-receiver-exchange" as i_op_events

        op_c -- PACT
        vm_c -- PACT
        vp_c -- PACT
        i_op_events -- PACT
    }

    package VRUM as VRUM_package {
        [VRUM]
        interface "<<REST>>\nVoting right status" as vr_status
        vr_status -- VRUM

        interface "<<REST>>\nConsume voting right" as vr_consume
        vr_consume -- VRUM

        interface "<<REST>>\nLock voting right" as vr_lock
        vr_lock -- VRUM

        interface "<<REST>>\nUnlock voting right" as vr_unlock
        vr_unlock -- VRUM

    }

    package "Control Components" as CC_package {
        [Control component] as CC
        interface "<<Exchange>>\nVoting protocol" as cc_proto
        cc_proto -- CC
    }
}

package "Vote Receiver" as VR_Package {
    [Vote Receiver] as VR
    VR --( op_c
    VR --( vm_c
    VR --( vp_c
    VR --( vr_status
    VR --( vr_consume
    VR --( vr_lock
    VR --( vr_unlock
    VR --( cc_proto
    VR --( i_op_events
}

@enduml