@startuml

class "Operation" as op {
    identifier: string
    name: string
}

class "Operation Configuration" as op_conf {
    id: number
    label: string
    description: string
    event_date: date
}

class "Protocol Instance" as p_inst {
    protocol_identifier: string
}
note right: this identifies the protocol instance \n within the Control Components,\n (protocol layer)


class "Voting Materials Configuration" as votmat_conf {
    voters: list<complex_type>
    printing_authorities: list<complex_type>
}

enum "Validation Status" as valid_status <<enumeration>> {
    IN_VALIDATION
    VALIDATED
    INVALIDATED
}


op o--> "0..1" op_conf : configuration in test
op o--> "0..1" op_conf : deployed configuration

op_conf - valid_status

op_conf -[hidden]- p_inst

op -> "0..1" votmat_conf


class "Configuration Deployment Request" as deploy {
    requester: <user>
    validator: <user>
}

class "Printer file generation request" as votmat_req {
    requester: <user>
    validator: <user>
}

enum "Request Status" as req_status <<enumeration>> {
    PENDING
    ACCEPTED
    REJECTED
}

deploy -- req_status
votmat_req -- req_status


op_conf "1" -down- "0..1" deploy
votmat_conf "1" -down- "0..1" votmat_req


enum "Environment" as env <<enumeration>> {
    REAL
    SIMULATION
}
votmat_conf - env

enum "Protocol Status" as protocol_status <<enumeration>> {
    INITIALIZING
    PUBLIC_PARAMETERS_INITIALIZED
    GENERATING_KEYS
    KEYS_GENERATED
    GENERATING_CREDENTIALS
    CREDENTIALS_GENERATED
    ELECTION_OFFICER_KEY_INITIALIZING
    ELECTION_OFFICER_KEY_INITIALIZED
    READY_TO_RECEIVE_VOTES
    SHUFFLING
    DECRYPTING
    GENERATING_RESULTS
    RESULTS_AVAILABLE
}
p_inst --> "1" protocol_status

op_conf "1" --- "0..1" p_inst

@enduml