@startuml

together {
    package PACT as PACT_package {
        [PACT]
        interface "Shared\ndirectory" as shared
        interface "<<REST>>\nEarly tally" as e_tally
        interface "<<REST>>\nTally\narchive" as ta
        interface "<<REST>>\nVoting period\nconfiguration" as vp_c
        interface "<<REST>>\nVoting material\nconfiguration" as vm_c
        interface "<<REST>>\nOperation\nconfiguration" as op_c

        op_c -- PACT
        vm_c -- PACT
        vp_c -- PACT
        ta -- PACT
        shared -- PACT
        e_tally -- PACT
    }
}

package Backoffice as BO_Package {
    [Backoffice] as BO
    BO --( op_c
    BO --( vm_c
    BO --( vp_c
    BO --( ta
    BO --( shared
    BO --( e_tally
}

@enduml