{
  "$schema": "./node_modules/ng-packagr/ng-package.schema.json",
  "lib": {
    "entryFile": "public_api.ts",
    "umdModuleIds": {
      "@protocoder/blake2": "blake2",
      "underscore": "underscore",
      "immutable": "immutable"
    }
  }
}
