@startuml

together {
    package PACT as PACT_package {
        [PACT]
    }

    package "Vote Receiver" as VR_package {
        [Vote Receiver] as VR
    }
}

    package BB as BB_package {
        [Bulletin board] as BB
        interface "<<Exchange>>\nVoting protocol" as bb_proto
        bb_proto -- BB
        PACT --( bb_proto
    }

    package CC_0 as CC_0_package {
        [Control component #0] as CC0
        interface "<<Exchange>>\nVoting protocol" as cc_0_proto
        cc_0_proto -- CC0
        PACT --( cc_0_proto
        VR --( cc_0_proto
    }

    package CC_n as CC_N_package {
        [Control component #n] as CCN
        interface "<<Exchange>>\nVoting protocol" as cc_n_proto
        cc_n_proto -- CCN
        PACT --( cc_n_proto
        VR --( cc_n_proto
    }

@enduml