stop_order,stop_id
1,001196
2,001176
3,001032
4,001031
5,001137
6,002427
7,002432
8,002434
9,002435
10,002437
11,002555
12,001213
13,001251
14,001464
15,001522
16,001784
17,001606
18,001409
19,001410
20,001408
