stop_order,stop_id
1,94A696F37A3C7FB5
2,76BE3FDBD820CCB7
3,0ED8503933F861D8
4,CEFDCD673C8E07B4
5,23D55F990E97E8DF
6,A1034BF3E773BB68
7,1EDCDB755F40EB55
8,EC715C570AB11722
9,384A48BF88CB0637
10,11B2034DDF30617A
11,33033960343A57A8
12,BE27F066CF40DF7D
13,07521BB848913F74
14,A21BEB6F4E6D43E6
15,9268B442F0C2807E
16,5358062C769CEC05
17,3CE7B5D1EBF9C5F7
18,750ADEB14D018CF7
19,8B8DDE8FC3A125B8
