stop_order,stop_id
1,002536
2,002554
3,002440
4,002443
5,002445
6,002447
7,001140
8,001122
9,001034
10,001036
11,001038
12,001193
13,001628
14,003359
15,002602
16,002041
17,002031
18,001923
19,002035
20,002013
21,002014
22,002010
23,001934
24,001938
25,001939
