stop_order,stop_id
1,5C63A2B4F457D344
2,C8A9DAB5E9051324
3,924D67DD8AB7683D
4,E7BFF1027930CCCD
5,E68FF6CC803A14A2
6,620E14F31DA31490
7,32F5F33FA68B77D6
8,0A1DAEAFFDFF0B66
9,3A2924B2461D053B
10,066AA1A504714A20
11,1423FCFF61709EAC
12,0E65D3EC41A1D34B
13,4E3FEA4E559A5D16
14,DA17B01A4A61A358
15,6C11A9780213BBBB
16,7EA4C557505395EF
