stop_order,stop_id
1,6F666C5235BD859B
2,E70EDF92FE8553E2
3,FAAD25334A972923
4,42AF8D1ADA2FA6C0
5,C9A46DDC082BAEE0
6,BBDFF2D05E37EE61
7,266A4CDA19461A42
8,31852497A98F4A15
9,26A996F589C84844
10,F374B56E275194D8
11,9274EF6791CA3ED8
12,CDB292D507E4302D
13,C55F50E43F6108EB
14,2AEDE966C122B71E
15,6716018C3EE42733
16,7BECB2120CD69543
