stop_order,stop_id
1,9386CDB16D533E27
2,B8B04CD1E568B8F6
3,04A3BB80D09B6106
4,B2C63864D1C98F56
5,033CB7A21D6DC60C
6,6C1C752975B8A257
7,68D0BC0C7164F763
8,8E3A5C15E42020BB
9,EDF107F1315D6805
10,77BFE3A169866C7D
11,E10A0960D4E103B1
12,EAE9158BE729E917
13,452AD79BA74CF8F3
14,DCFF4041D0C0ACF8
