stop_order,stop_id
1,0D8135B0D81F29A1
2,40FF132FB8E77051
3,B08CA4B3CDCF142A
4,CF18D17DE7B40350
5,ECBD286CC9ED9549
6,DEB36380E32DCD53
7,FA246A7F26F12EDD
8,B9D7AE7CB0C56556
9,B7082198F517B1E8
10,93084A14AE624C6F
11,D17050E8964504BB
12,04DDF4F7F1C74876
13,BF08F9C08BB54A2B
14,2BB6115BF9346B34
15,6E113B962058A553
16,581AAE2C80571C37
17,C21FA8D54031D7FF
18,8571BCC3A3E4006E
19,D9896F1A5B7C97C0
20,3BA9C90738A8600D
21,29B66F2353388E18
22,AA6F0A2661759A49
23,92540DF9CB08304C
24,325D388E2C927954
25,E77716C29E34669E
26,00ACB49D76C8C16F
27,D64C1350EE61A2AD
28,A90CDCBFC07EDF86
29,9DBBC71CB1578A87
30,312CD2A987AA2773
31,40E8A4AA35AEB18A
32,65B934D14EA190F1
33,6F5585807DB07812
34,7B98BAE3D93817AC
35,14F176D358D65A8B
36,8E3A5C15E42020BB
37,97CE87CF035B0E10
38,96442B84082D4DF5
39,508D99EBC9AB3A9B
40,E10A0960D4E103B1
41,FE56DD70DEDE0395
42,1DEB855D55528B03
43,11A1269F9B78F269
44,0840B3F75A7B00BD
45,FE4E099AEA040C89
46,E46A9F0C0CB609F5
47,3D040EE809057C6E
48,4BE7B829FA08FF82
