stop_order,stop_id
1,001913
2,002031
3,001885
4,001886
5,001887
6,001888
7,001889
8,001890
9,003484
10,003543
11,003485
12,003486
13,003487
14,001891
15,001892
16,002048
17,002049
18,001893
19,001894
20,003363
21,002603
22,002604
23,002606
24,002608
25,002675
26,002611
27,002613
28,002614
29,002616
30,002618
31,001629
32,001028
33,001029
34,001030
35,001174
36,001137
37,002427
38,002432
39,002435
40,002438
41,002535
42,002536
