stop_order,stop_id
1,1CBA941164585ABC
2,80F5C6317F17C099
3,C9261749DE3F7FEF
4,5B5ABCFBD1F60FEC
5,0FC0EE0AEA556A4C
6,251112E838705DCD
7,16D37394ECACA7AD
8,812E72C257C94B73
9,710390556FA80CAD
10,414700CC27B0F9DC
11,43BFFB46B4D209FC
12,094457650286AA67
13,9E16397100F502B9
14,121D3CCF6A82532F
15,90DC2AE9EBAF2658
16,4E037679702BBCBC
17,AEBDE6434969EED9
18,B1293E41AE9CB55F
19,F893C6ABC2743F64
20,B27236FC63F891D9
21,A15FFC3149FB92A0
22,88E23CD2F1AB7AF9
23,0B160DE955F3AE10
24,830FACA208087E37
25,E51BB6A7525BA679
26,76F0BFCC3D78F888
27,BA55DB38DEF14AD4
28,6B582CAEDE8FBDEF
29,76A2633F9A463E9C
