stop_order,stop_id
1,001757
2,003032
3,003028
4,001702
5,001703
6,003029
7,001704
8,001705
9,001448
10,001503
11,001463
12,001367
13,001288
14,001271
15,001272
16,001273
17,001274
18,001275
19,001276
