stop_order,stop_id
1,9F542D4B6CF41651
2,739A5DDE0CF1970C
3,9E95343C77BB85E2
4,2D1A8946EF054FC9
5,DADEC4FDAD7C58B3
6,E8F5E085BAEFE100
7,79FD1B44D37205B8
8,F8F0E91589F099CD
9,5747450359C7907C
10,33ABA49F0E91A247
11,B34F59A0270AEDA4
12,B644204AEDE7A031
13,5C2A974134634635
14,A0D379E172F5BC93
15,853CD1316EB5227B
16,BE6EC9708F5FB613
17,9F542D4B6CF41651
