stop_order,stop_id
1,7A79D102443D6822
2,60E02B7ACBBB80E8
3,5089C69E080B7A43
4,E4C26E79F0D6DC5E
5,47B8E78BAB4FEB5D
6,5D77A5CBE41F2984
7,C80FB453C9F53569
8,C160C8F46BBBEF99
9,C650BECDAF9D9EB0
10,E507F6160447C129
11,DCFF4041D0C0ACF8
