stop_order,stop_id
1,2802E2DEE1D48B51
2,FE2815CBCD21C57C
3,F2508598F5A43655
4,3313287185163530
5,8E8DB91C885F1230
6,4A38244491180BF7
7,5419928D472EAD8D
8,357B7D41501CDACA
9,D7C7D86E923EEAE1
10,A76BB6FCB881AF5C
11,0F4F935A9F14F111
12,7ADC6D521E6BECE6
13,E02E10C9135624F9
14,3F21ED54F86D9B1D
15,BA4AAEE586402CD4
16,91481C9100917BA7
17,40829C12642639D4
18,16A7F2C343AA6DE6
19,4B0E21EDF07F9C83
20,1CF4AE2F7045B848
21,CB667DC000F66D40
22,5E073AD8BC9F2AC8
23,B31E6B9D8E5B4493
24,3A450B5AD5AF1605
25,0E2175C0750054FE
26,0D4E07F475845DB3
27,8CFD0DAAA2D9B47E
