stop_order,stop_id
1,D44F9DCC71251889
2,3582449B6BBC72AB
3,13568DBEFE3503A6
4,87F9F165B63331A5
5,5164AE1A29DEA71A
6,3FBF0DB2F9B1524A
7,F95704C1ED9C54BF
8,2DE55F5F52F8A3AF
9,D926EC9FC8BCE6BD
10,564C0ECAAC09C371
11,412DEEF534E127AF
12,C552CE565E1F0C85
13,2B0F088D932881AC
14,21466046C6868AA7
