stop_order,stop_id
1,002980
2,001450
3,001451
4,001577
5,002981
6,001809
7,001810
8,001811
9,001812
10,001813
11,001600
12,001531
13,001532
14,001533
15,002982
16,001476
17,001258
18,001267
19,001268
20,001393
21,001287
