stop_order,stop_id
1,34AD4356DEF0E0BD
2,80E207687865EDE7
3,1E81121E54BA1E71
4,E67CDE5E499A9529
5,DA9E78C0D00A5C00
6,754018D85575639C
7,EFF76047DAB0578D
8,D718ABC314AD4B3C
9,B930AD84BC1A8655
10,F3BA995562185F8D
11,D790D851F74E29ED
12,FF3C034E01D2F73B
13,F3C6FD22BC86B80F
14,784D9D1F3FFC2A71
15,8581AEE08587F6AE
16,9E082924A8362902
17,0E7D925FC7469830
18,22D8393C78C95BBC
19,13362EE5DC44432F
20,11387D20F8DCA372
21,F853FAA669228E41
22,6B35AF30748EDA1B
23,2D10E16919B5A96E
24,F0D6CB5F04988EA4
25,3291342581C48037
26,D1C1E33BB9350C65
27,F6FDEAF741BFBD2E
28,1345D70225C59BD3
29,3210F3BCFFD74E61
30,4EBE182141C52094
31,E1C5246F946E2D86
32,34AD4356DEF0E0BD
