stop_order,stop_id
1,5E1FA939586B3FD1
2,28E722A4FDD9ABB9
3,5476E155980E85F9
4,03DF3BB7102FE4A4
5,64046AF19443F736
6,EEE72EA029EB8438
7,D85C3A15814F927B
8,040BF3E98E34C65C
9,DDEF448B9FD8E0A5
10,A494158699C58BFF
11,9B876C4A7054DCF5
12,E2385520ADCFC607
13,6F36400A6E1FBE49
14,B78CDC6E85060BE4
15,BF876DC97B6395D2
16,177F8A8A3716DBE0
17,66EA5E4B2C7CAE82
18,98A787294A2089F6
19,9FE135F7D7D377E6
20,B7F443B0BB14A4EC
21,BD67BA334834CACB
22,6FF0624000B3D53D
23,982E419BB26ED8AA
24,8F60B176234176D8
25,431CFBCADDFF352C
26,6D12ACD9163EDD99
