stop_order,stop_id
1,82FBCA6799699AA0
2,028E0B68D3166C00
3,BC45FA032C515D44
4,823E3EE2413E40E2
5,E7133179F5800E85
6,E34E3D48842C9B66
7,DF9E89A391CAC245
8,657E5836BC932790
9,7A1C43F91CF8A6FC
10,60F1DDDCB555E319
11,F7CAA2D4FF9D61F7
12,14F176D358D65A8B
13,8E3A5C15E42020BB
14,96442B84082D4DF5
15,508D99EBC9AB3A9B
16,FE56DD70DEDE0395
17,D2217D7746597D10
18,5D75A800F823B45D
19,1864222D8939BD69
20,2802E2DEE1D48B51
