stop_order,stop_id
1,0035CDF15614428C
2,B8E228521E55C7C5
3,C305A8135A09C094
4,C1E9F8237EDBBAD2
5,7F068ADB0659F04E
6,779954C17EAF3B95
7,F8BB84BC801E4C85
8,BC39BFC3C7BC3009
9,2FABE52A66DF7482
10,F0852C7827CC97EB
11,7E3C2CA5ABEC8416
12,51D13DDB8EBA98AF
13,FFBEBD7068E01EA4
14,9ACC26CD04287102
15,711927A9FAEF1158
16,F09FF6C6349030C6
17,D13C7436B13B4A4B
18,EC9467FAB4EC7203
19,938667F4F953DFCA
