stop_order,stop_id
1,C799751FDFCE292E
2,F19EA5A24A38C94C
3,FC63E0A36323E494
4,EFEE1D1E1BF3140C
5,EF78DD9F765C6565
6,07EEE519D04FFE28
7,000CFEE2F92DC17B
8,BA995ECF3EFCA99E
9,879A98CD29D9433F
10,6C2DBC45160AA4BF
11,E5F082F4C7300273
12,18FB32A8BE19CB57
13,753E63DCB2FFD3B2
14,0BB054192087F527
15,EAEA62781C49856C
16,D395E730FC3A3473
17,EA6152DD7165E9DC
18,9B07890D73E13AE4
19,1927F52F4ED872E5
20,F8619A3F780D4072
21,3A3B108F799F3326
22,7F8CEE1F02103A4A
23,74A2E12A2DC55FE0
24,5CEC0EA1BB2D6D11
25,D3EBFAC0D6EE8DD5
26,84891259878A06F5
27,C7C774CD6AE937B1
28,24FEF0BD13752095
29,552DA8FCE732ABF0
30,ADB789C140CFBE00
31,37AEC610CEBCEA48
32,8EA1F6CDA69E539C
33,AC1FD9BDD09D1DD6
