stop_order,stop_id
1,2CEEB19BC6404A39
2,7E3C2CA5ABEC8416
3,D54A59914E577E3F
4,3F01C915E856B018
5,6282A73360ACEBEA
6,20B9196322225611
7,2E6DB54618C13048
8,6953AEF8B3921959
9,437D60C455A624E6
10,EEDFC5EC1DD36179
11,458D2C951A759CAD
12,9096776C02070F8E
