stop_order,stop_id
1,D18861DD66E59F95
2,51D13DDB8EBA98AF
3,03A546A0953794FA
4,52C1ADA57FFA7DD4
5,F4ABF71262D8C556
6,539C1C625EA036B1
7,45AB0EC4F195CA7A
8,66BF94751BD28BAD
9,4432C7295979305C
10,CCA2F903BFE60A31
11,620E14F31DA31490
12,0E61C7B5C90B8CAF
13,09DF70F8DE2426BE
14,7019D5AE9C63EE72
15,92A8281D80524F78
16,031CF3D5B2BE9CE8
17,7F8529494720703C
18,36880B47F043D519
19,4E870B220826BEE0
20,5AD2A4D21C226335
21,A454170B2B59B587
22,F41714406F2D4E00
