stop_order,stop_id
1,001249
2,001279
3,001281
4,001282
5,001283
6,001286
7,001333
8,001334
9,002454
10,002414
11,002415
12,002416
13,002418
14,002420
15,001033
16,001034
17,001036
18,001037
19,001193
20,001628
21,001853
22,002714
23,003550
24,003540
