stop_order,stop_id
1,577490AF159C4088
2,450A96AF1DA8E41C
3,C91C122CFC3FF66B
4,0E9F8B5A3734D9CE
5,FABC0445FC1C04D7
6,3A43E432D0588F79
7,E6124D0EDF568E1E
8,701AC3250BF77D0E
9,48AA5A2907C1833D
10,89A4D25AC31A8388
11,6465986EF7824816
12,F21DC659FA565E2F
13,48E5A1EED91712EE
14,4E037679702BBCBC
15,AEBDE6434969EED9
16,B1293E41AE9CB55F
17,F893C6ABC2743F64
18,B27236FC63F891D9
19,A15FFC3149FB92A0
20,88E23CD2F1AB7AF9
21,0B160DE955F3AE10
22,830FACA208087E37
23,964AA1DCAAD06512
24,D237B30F94B6065D
25,7D025E77F4B35266
26,6B582CAEDE8FBDEF
27,FD18FAF570857B51
