stop_order,stop_id
1,635D6769D9C2C20F
2,11B2034DDF30617A
3,33033960343A57A8
4,F6A446C66F7F805E
5,35CD2E3911AEA038
6,C847FC07707BC068
7,AA62C03711F778F2
8,2F7C67769B9FB896
9,E99D3F96A9F7B5EB
10,0543B8455A70833F
11,D446D1EA79502BF2
12,FE3B13A457EEA70C
13,138A71694F5A3451
14,4A8AAC7402C3F60F
15,100E6F60BAC1BDEB
16,23AF5995FEBCA8E6
17,8C09B3648DCDAF3C
18,6465DE9EE57F6C94
19,3E73B73B12E25DCF
20,3F9AE21DC3A540B9
21,8B8DDE8FC3A125B8
