stop_order,stopId
1,40
2,235
3,236
4,237
5,238
6,239
7,240
8,241
9,242
10,243
11,32
12,30
13,244
14,245
15,246
16,247
17,248
18,249
19,250
20,251
21,252
22,253
23,254
24,255
25,179
26,64
27,65
28,66
29,67
30,68
31,69
32,70
33,71
34,72
35,73
36,74
37,77
38,78
39,79
