stop_order,stop_id
1,26AC2D471648CA0C
2,2E734BC49E03D3D7
3,88E5894981B2D9D8
4,DFB7FD5832A4BA4E
5,42827007F74D36EA
6,1A37A52F97A04C81
7,B085DDE8E381E370
8,DE99B27530D1A3C4
9,A25160BA84EE09F7
10,DC28E30AF099D339
11,EE0ACB2B516C305E
12,45A499CD3132E90A
13,75AA9801B870CCE1
14,6F29E09A140E6F54
15,140E4137EAC319B5
16,2658CCFAB79763B6
17,D2EF3E1D638B1B9A
18,063AFC6BA7D7CE0B
