stop_order,stop_id
1,002337
2,002341
3,002342
4,002259
5,002157
6,002158
7,002159
8,002344
9,002383
10,002345
11,002346
12,002221
13,002216
14,002218
15,002544
16,002545
17,002546
18,002524
19,002525
20,002526
21,002527
22,002528
23,002529
24,002530
25,002531
26,002532
27,001289
28,001346
29,001347
30,001238
31,001240
32,001241
33,001242
34,001209
35,001210
36,001324
37,001388
38,001325
39,001326
40,001327
41,001247
42,001244
43,001254
44,001255
45,001249
