stop_order,stop_id
1,7CB0618D76B5F553
2,9CF00A30796B6B2B
3,3350CE851FCC56A3
4,2F82535CF1C5BF3A
5,EA43CFAD630C4690
6,1C4E76186CEFBCB7
7,7CA9FF2CDD3C4EE1
8,6DAB37A3FC9475C3
9,0393E099E78BEB94
10,6A5061ED084A2E4E
11,6F29E09A140E6F54
12,FD782C97D1FD97E0
13,2658CCFAB79763B6
14,E615D61C588B8F9D
15,C3672D8D28801773
16,34FBE7E973FE5EF5
17,66FB0FCA51BFD6A3
18,D198122830A4FDE3
19,99EF4CA10B3E1F17
20,326199D24220A42B
21,F893C6ABC2743F64
22,38330C642568FE3F
23,A15FFC3149FB92A0
24,9DE875FD17C67097
25,68B207DDC9A182AB
26,4BD5CE5106BB0697
27,6465DE9EE57F6C94
28,3E73B73B12E25DCF
29,CF579AAA2A4E506C
30,0B8C52E4C34E3B64
31,144E9479168069DD
32,7459D3AB11AFD6B5
33,2E2AD8BFE00F9FAB
34,3CB982FBC9E50AAA
35,F49FA120DE5E6582
36,1EF0671DB830C59D
37,23727783D2D3E994
38,EF17FDCDDF170D38
39,C1E7742780E828E9
