stop_order,stop_id
1,D9AAA33F19B8E45A
2,10590D40479607E8
3,7E035AF141396291
4,D5E1A3D34328F867
5,1FAA805BF1635668
6,B9DF2752D1309B49
7,4D1A76F3B9785DFA
8,29F6FE2F0824FEAA
9,6AE5EC17DAE4E646
10,883E42D32C6AD101
11,9762FC524B26C4A7
12,7A95C545D0393126
13,C048D4CF6ED36C7A
14,68A8F08ABC5C90F0
15,91929D42214F3D7F
16,97B7EC0354E020B7
17,ED03E689B88CE0E8
18,B122FA4A77BABF24
19,0389A57B9FCD3AB5
