stop_order,stop_id
1,002550
2,002453
3,002552
4,002553
5,002405
6,001475
7,001769
8,001547
9,001549
10,001552
11,001774
12,001516
13,001630
14,001693
15,001694
16,001638
17,001639
18,001636
19,001635
