stop_order,stop_id
1,3B68D3389F83FE39
2,ACA7282A66D0A29B
3,549013DC1C3A2A44
4,ADA4B4F4B604885B
5,9364661BEAC5B8D0
6,8D386F5D210C3439
7,2F4939964761E1FF
8,1030A4E612B75901
9,BD06457129045F1D
10,B0DDF2CD704116C8
11,6C1DEF32B8CB92C4
12,7210357910C44570
13,100E6F60BAC1BDEB
14,F60097D67F33DC0C
15,5B49CF04EAB59906
16,59FF8DDFC4405C0D
17,DE60928B8CFD9E7C
18,6557A31762F5311F
19,90ED381AD3BAE4F9
20,534DB02642325617
