stop_order,stop_id
1,D74B67D55C63895F
2,249DF4A1B287E14F
3,AF9FE138E3D5D5F0
4,1D44677AEFBA8773
5,18580F35B0A312CF
6,40ADE0A2BB16271A
7,333A88A8E07C956B
8,B2442AC56532517B
9,78644FF7E8B7BBA0
10,0221966C1116C4EC
11,4F3D6BA55D5FFFE1
12,5971529D89929BEA
13,FE235D7DCABCA944
