stop_order,stop_id
1,3DA2B5ABEA985788
2,51B9CE80774449E9
3,16E1175180DCF777
4,5DA6860E45D1384C
5,459C4588BE4A2105
6,B7A9E1A243516288
7,EFB9F85F98113CB0
8,55B5E2A727CAA86D
9,E757600B79B0B2AC
10,4039C75BB85BF238
11,FCCAC3FC3C8A66E2
12,E3B8D0FF5C269463
13,A6631CAD2E2DE2A6
14,6ACFA599CC0EA4E0
15,84FC122EC64D8885
16,197315C40E767929
17,225D34B4D891AFB1
18,412DEEF534E127AF
19,C552CE565E1F0C85
20,0D5759F7A4B185FE
21,21466046C6868AA7
