stop_order,stop_id
1,A588A5F294B4BEFB
2,F01F8CF411A34AA7
3,AE9F399F5ACF4837
4,9DA9C859E574B8B4
5,A701BCC43DF54B6B
6,FC28F96F0BAF8FF7
7,5159E5E97EA88D9D
8,E553B839AD6A8C3D
9,889F84EBA6D9571A
10,028FA893A173A464
11,50FF703302734DFF
12,C0AA7F3501EFA657
13,337C68B5F413E04E
14,64E7A52D975DF3FF
15,1DD522300A4B9406
16,6418176FB389E363
17,BD0E2A233376612E
18,EAFC59DD23C39D5C
19,1A0BCDF4BDC3E1A9
20,A4EBD881BA65C831
21,05C0C27B083F2C00
22,E7A9A0C621301623
23,33D2B3AB9D2CCDF3
24,338E70093D993E7F
25,0B071FC4D33FC334
26,F5D2D669376286F9
27,633C082A94176ED0
28,7ADCBB1CA80611B0
29,BB8D798D19066A35
30,3408E0103E0757F3
31,170ED32B19DC1828
32,6ABBD9BC03DFAB0E
33,884300BD53E9D626
34,1E7D74AE0C8EDADC
