stop_order,stop_id
1,001837
2,001845
3,001831
4,001872
5,001838
6,001842
7,001862
8,001858
9,001859
10,001857
11,001876
12,001878
13,001880
14,001882
15,003443
16,001854
17,002862
18,001483
19,001484
20,003054
21,001477
22,001596
23,001478
24,001479
25,001397
26,003352
27,001534
28,001535
29,001536
30,001529
31,001572
32,001642
33,003005
34,001689
35,003279
36,003280
37,003281
38,003282
