stop_order,stop_id
1,003254
2,001475
3,001412
4,001413
5,001534
6,001535
7,001772
8,001529
9,001572
10,001642
11,003005
12,001689
13,001452
14,001448
15,001503
16,001504
17,001505
18,001506
19,001797
20,001508
21,002977
