stop_order,stop_id
1,001382
2,001311
3,001366
4,001312
5,001226
6,001227
7,001228
8,001339
9,001340
10,001341
11,001387
12,001229
13,001230
14,001231
15,001232
16,001233
17,001300
18,001301
19,001302
20,001303
21,001304
22,001288
23,001271
24,001272
25,001273
26,001274
27,001275
28,001276
29,001277
30,001279
31,001281
32,001282
33,001283
34,001286
35,001215
36,002573
37,002535
38,002408
39,002409
40,003469
