stop_order,stop_id
1,51177BE1EFDE8D1E
2,A13C2C1D5D3EE0D7
3,AE7C79C814E6BD95
4,C5294C92C5C6E334
5,D39CFEB43490567F
6,1423FCFF61709EAC
7,D46D92A924B2F0FC
8,4E3FEA4E559A5D16
9,BB04686A2E0D7578
10,72F743E4D464E498
11,28B264A688848238
12,709C8604AFB90F27
13,8379C4B1265C27F7
14,C804CCACB2781EEE
15,AD1B202B678A3B56
16,B30799FB3732222B
