stop_order,stop_id
1,71D916F7E97D18A3
2,42AEF6365E78DA56
3,8753A8442C2FFF53
4,1BE574CAE40EFF17
5,797CC0222B9EFBEF
6,308112BE50081258
7,D2425B7147B58E1D
8,A4607B71730E8F46
9,189AC37A164008A6
10,7E2E1F1269E520DE
11,ED364A58F885DC92
12,D6C06E7091666AB4
13,F8D8D0AED9889278
14,2D33D39F61B74C5D
15,AAB411C52D067AD1
16,558D298696B57A4D
17,0E65D3EC41A1D34B
18,4E3FEA4E559A5D16
19,DA17B01A4A61A358
