stop_order,stop_id
1,9E376227A51AB6BE
2,9CAF2FDA35EEF9E2
3,AB057A63C24E990E
4,68106C827BF891AB
5,20D0C9CBE2BC9451
6,0E9F8B5A3734D9CE
7,775FC7E2B86C4E3F
8,01A56227D21AFB04
9,6D286CD9A26AAFB3
10,4884DCF89AD7BA6A
11,48AA5A2907C1833D
12,8D5C58075D3C1003
13,B0DDF2CD704116C8
14,6C1DEF32B8CB92C4
15,161B32AD4C6996AD
16,6965D1D655C2DD5F
17,6AEFD1C261E8E4D8
18,0543B8455A70833F
19,D446D1EA79502BF2
20,8815F901477E6435
21,20915DF05723C615
22,FE3B13A457EEA70C
23,138A71694F5A3451
24,4A8AAC7402C3F60F
25,100E6F60BAC1BDEB
26,23AF5995FEBCA8E6
27,C970D8254790191E
28,6557A31762F5311F
29,90ED381AD3BAE4F9
30,C6795D3E5B50AD5A
