stop_order,stop_id
1,EAA44CDBC231DB8C
2,75D57F5A5891A1C2
3,03A546A0953794FA
4,FF98F738E3D0FE6B
5,913C39C617BFCECA
6,9B908B19CE774219
7,E7133179F5800E85
8,DF9E89A391CAC245
9,657E5836BC932790
10,7A1C43F91CF8A6FC
11,60F1DDDCB555E319
12,F7CAA2D4FF9D61F7
13,14F176D358D65A8B
14,8E3A5C15E42020BB
15,96442B84082D4DF5
16,77BFE3A169866C7D
17,A6AED77D365E7011
18,EAE9158BE729E917
19,452AD79BA74CF8F3
20,E3A083E4F64D93CD
21,2EEB9CB69FB6A58D
22,0CC0B21EFF42EE19
23,9B45E50457274D2F
