stop_order,stop_id
1,1E7D74AE0C8EDADC
2,3EAF33C37104D168
3,E433215F5B80E93C
4,B404A065F58A5F64
5,175CBF43CD330A0A
6,350EBC52D2ABF3D8
7,FD752B76C5C6517B
8,A334D0EC59D94F8D
9,51E6A73EBA9A0FF5
10,75CE4282D2043790
11,C00C986B85A2220E
12,D6E7443BD2222BD7
13,4E2C01EAE9535C14
14,E6735B26B2F1D68E
15,A6443C45124970B9
16,BB9D2A6E7E713664
17,D9E20788B8C9FF64
18,13C75FFFA2BB060D
19,D1D807234805DBF4
20,153D32217234A0F0
21,893BBB901005C3E6
22,BBE77B90CE43AEFA
23,246B98B8B9F002F0
24,38F0C9768AA2AF93
25,730AB612DCDF58C8
26,1A85A6C132C4197F
27,C3FD63E226246052
28,098AF67CBBB9FBA9
29,0BADB28A19C2E0BE
30,6762DEA1B89E6354
31,A588A5F294B4BEFB
