stop_order,stop_id
1,5E2EC7476D55E0BA
2,AB057A63C24E990E
3,B0028A481BF4ACC7
4,5419928D472EAD8D
5,2F281B3C90B46763
6,A93947027435EBAD
7,F56B1C6169FFC940
8,4A2B9089021412CD
9,F5ACAE2B0ACBC9AE
10,E907FA24426A9FD6
11,ED244F7BBACAB14D
12,89A4D25AC31A8388
13,6465986EF7824816
14,F21DC659FA565E2F
15,48E5A1EED91712EE
16,3A445E0351331BCD
17,90DC2AE9EBAF2658
18,4E037679702BBCBC
19,67C00FA00C878C1A
20,7A899F3009A31F68
21,6C4DDD9C22580CA2
