stop_order,stop_id
1,002166
2,002172
3,002173
4,002210
5,002211
6,002212
7,002343
8,002344
9,002383
10,002345
11,002347
12,003429
13,002405
14,001475
15,001769
16,001547
17,001548
18,001552
19,001554
20,001555
21,001426
22,001429
23,001430
24,001431
25,001687
26,002885
27,001434
28,001517
29,002852
30,002853
31,002847
