stop_order,stop_id
1,B9F19D629C894FEE
2,79BB89DA868D93CF
3,BE47845FF3E717FC
4,F01F8CF411A34AA7
5,AE9F399F5ACF4837
6,9DA9C859E574B8B4
7,A701BCC43DF54B6B
8,FC28F96F0BAF8FF7
9,1E29A8A8D3F6BABB
10,E553B839AD6A8C3D
11,889F84EBA6D9571A
12,6FFA120DD2FA4790
13,32491C3A5645AD42
14,C0AA7F3501EFA657
15,337C68B5F413E04E
16,00040ED8B61CA94B
17,64E7A52D975DF3FF
18,1DD522300A4B9406
19,6DD60A482B4CDAF6
20,388C3DB16F0F2719
21,719B6A48C203AFBA
22,4BF5A563B95D2F42
23,9AD628EDE1178D24
24,5D26737FDFC4F738
25,3147FEC6D6DC535A
26,4830E097480D3AD6
27,EE1C91F3EDCEBB7E
28,277B784B9369F9E1
29,85363AEF68CB6277
30,5A7CD7DCB08F92C2
31,38504AAEF0A5E595
