stop_order,stop_id
1,003710
2,001695
3,003711
4,003284
5,003712
6,003713
7,002976
8,001829
9,001503
10,001773
11,001655
12,003592
13,003593
14,003594
15,003595
16,003160
17,003225
18,002919
19,002920
20,002921
21,002922
22,002923
23,002928
24,002929
25,003329
