stop_order,stop_id
1,001676
2,001677
3,001678
4,003234
5,001755
6,002908
7,001672
8,001726
9,001727
10,001754
11,001818
12,001819
13,001820
14,001821
15,001778
16,001728
17,001751
18,003589
19,001491
20,001492
21,001522
22,001521
23,001493
24,001494
25,001495
26,001496
27,001498
28,001499
29,001500
30,001501
31,001525
32,001695
33,001690
34,001524
35,001465
36,001615
37,001724
38,001765
39,001725
40,001853
41,001832
42,001833
43,001834
44,001836
45,001845
46,001866
47,001867
48,001872
49,001838
50,001842
51,001862
52,001858
53,001860
