stop_order,stop_id
1,C3427DE8E291FFA6
2,F8D1049558163BE6
3,7703B0499F66B205
4,33954A6034D48443
5,4F8B610B0A033DA3
6,9C65FAD146B82C8D
7,0B6F13BDDA1B8F91
8,EAF0EAB6E30425BA
9,3B672FFFDB172686
10,E50D6F218BC33CD0
11,E173F2DA030C6AAB
12,6E2A7A2CD29F9216
13,99256D08CF861BA5
14,3CE4A2049409A6DD
15,E6ED785726AED4AE
16,C13E41666B5A1394
17,C6E9CA12DCD8F695
18,7C5377EE48AA1E91
