stop_order,stop_id
1,001664
2,001786
3,001744
4,001663
5,001665
6,001756
7,001666
8,001667
9,001668
10,001669
11,001656
12,003458
13,001509
14,001510
15,001518
16,001519
17,001463
18,001278
19,001281
20,001283
21,001285
22,002568
23,002415
24,002564
25,002418
26,002420
27,001033
28,001034
29,001036
30,001037
31,001027
