stop_order,stop_id
1,B9F19D629C894FEE
2,79BB89DA868D93CF
3,BE47845FF3E717FC
4,ACA7282A66D0A29B
5,FF3CD465098B03A5
6,9DA9C859E574B8B4
7,A701BCC43DF54B6B
8,FC28F96F0BAF8FF7
9,652BD65D62F807DE
10,E553B839AD6A8C3D
11,DEB3135B3EBB8E9C
12,7B98BAE3D93817AC
13,5FD9F31BE3249D43
14,5CA7841E84D52C8A
15,6E764374E3F36BBB
16,3B8B261C1DA409BD
17,0F5CEC693FD6EB66
18,07E603DFCBEAEA77
19,1BA80A40CD423D33
20,CEEA538B2BDFE329
21,85060261088757CD
22,B0764B3D836822DE
23,82F73F339C0E0E45
