stop_order,stop_id
1,11FCA01F6AF8D08A
2,E9DE17E28F733B31
3,2F332E8471F31F27
4,216AEF6F6541ECF1
5,1ACA45F806F2554A
6,F69B2B317BEB37A3
7,2560149CE75EABA0
8,6437BDE588337654
9,D198122830A4FDE3
10,99EF4CA10B3E1F17
11,C847B9021C407731
12,38330C642568FE3F
13,A15FFC3149FB92A0
14,5D1E6432755E4F5F
15,279C78D8C04A83BB
16,BA03816A38B9DA7F
17,4BD5CE5106BB0697
18,6465DE9EE57F6C94
19,598F766175BE3EF3
20,0644E10571B8CA12
21,144E9479168069DD
22,7459D3AB11AFD6B5
23,9C839C3824F47A6A
24,CB4BB0008A87E4FC
25,CD3092383ACEF208
