stop_order,stop_id
1,635D6769D9C2C20F
2,11B2034DDF30617A
3,33033960343A57A8
4,97D1981DE7ECBCE7
5,DF7F22DF4F8A9D11
6,7613538D58A9C452
7,336FF66D1F0AC4A0
8,54FCA9F5D8F3587E
9,A49F0ABFEF9338FF
10,D13C7436B13B4A4B
11,EC9467FAB4EC7203
12,4E279C21A109E9E3
13,F282012BBB2865E5
14,B550EC84B77440F8
15,20FDDA894D722F88
16,4E7C1C7F6D191BCB
17,815BC43527FD9247
18,B3F2EC8E42FA3184
19,2307DECBF51E9D7F
20,07142A6203E50A47
21,E92E009DE3307F85
22,FC56A42F8EF929FA
