stop_order,stop_id
1,001850
2,001851
3,001848
4,001842
5,001839
6,001863
7,001845
8,001854
9,002032
10,001435
11,001436
12,001437
13,001438
14,001442
15,001802
16,001445
17,001446
18,001770
19,002849
20,001396
21,001423
22,001707
23,001603
