stop_order,stop_id
1,F6E65ED7BA637652
2,C3D2F84C0F0FF415
3,47A2AA98F8E20AE2
4,1E10D70B8D3AC179
5,A63B90588F747496
6,83B717529F9794BC
7,1D8A902219897402
8,A81B13297DB1C481
9,AD97EA183A25102C
10,E55FA660A59AB64A
11,E3B0A57678CFD140
12,31005C82D70F6B09
13,F8C20FE9111D486A
14,CF94083CB24CF4E5
15,4A76CDB32FA69BC6
16,6F11F73C749338DB
17,98EBAB9468C80DD2
18,6DD6B837EF1FA76C
19,AFD29CB1A4F71AB9
20,65ECD19EFD09FB74
21,4C97BE87FBF959C4
22,FA52803E2628A212
23,3AD4DADA5B941CF2
24,637DDC1A9BF31C4C
25,5CB1BDF367F1989F
