stop_order,stop_id
1,E5421509D8FC00AF
2,823E3EE2413E40E2
3,E7133179F5800E85
4,A401ECF82924D465
5,3D5F8A471AE2AE99
6,AB021611E13B83E5
7,BF24F3D6A39D8D99
8,4E366AF78461E12D
9,F91B28AE855628AF
10,674BF383CB19E1A3
11,E34E3D48842C9B66
12,DF9E89A391CAC245
13,657E5836BC932790
14,7A1C43F91CF8A6FC
15,98FCC750B322B706
16,BC294083A50B89DB
17,38CBB6C76211934F
18,F63C76EC97E38A91
19,777ED0B1F3CF10DD
20,96442B84082D4DF5
21,508D99EBC9AB3A9B
22,FE56DD70DEDE0395
23,D2217D7746597D10
24,576538E1395C8508
25,68DF2B78CD2B9C76
