stop_order,stop_id
1,EF15FBC5E8A02ADA
2,CF75BC81CDF3D411
3,896D3C4F7F91E9C9
4,C6F406D78E5C515A
5,0ABE48106C953AC9
6,66BF94751BD28BAD
7,3D5F8A471AE2AE99
8,6FA31E38468068B6
9,5C6B22551FFEB285
10,CAE09A3D7E2BE997
11,4E366AF78461E12D
12,AD0E19B05666A22B
13,C7C1C12D89968698
14,2431FF3100478DEE
15,ED6FCB0422D541F5
16,850F72123F644500
17,3821D64D2BF1BB66
18,66C6FDFC88F56E51
19,7CD8F96A087CDDF2
20,5029C93BB80545B1
21,A70C52925AAF4A1E
22,182976403F291FE0
23,82F385AE99820D83
24,B4BC12D061EC853E
25,6ACA5143BB7C496B
26,DD5CDB226E98FD0B
27,67387941757BB9DC
28,633A3F4B4A5637C2
