stop_order,stop_id
1,001152
2,001163
3,001022
4,001081
5,001059
6,001060
7,001192
8,002734
9,001063
10,002738
11,001065
12,001044
13,002737
14,001051
15,001137
16,002427
17,002423
18,002426
19,001475
20,001769
21,001547
22,001549
23,002817
24,002818
25,002819
26,002820
27,002821
28,002822
29,002823
30,002824
31,003428
32,002826
33,002825
