stop_order,stop_id
1,67FC11E66080F9C2
2,2CC694E5A84B05A0
3,5A1A5F0DEB7F8EBE
4,7081CE830F3E9B50
5,45628FA7B8D7C5D2
6,F7DD5A5E7E4D41C9
7,3FD481FB9B9DC36C
8,062FFE8F1560E8A4
9,74648B92E0E80E2E
10,4DD5EC5516B360D7
11,33ABA49F0E91A247
12,B34F59A0270AEDA4
13,B644204AEDE7A031
14,5C2A974134634635
15,A0D379E172F5BC93
16,853CD1316EB5227B
17,BE6EC9708F5FB613
18,DF9E89A391CAC245
19,657E5836BC932790
20,850F72123F644500
21,98FCC750B322B706
22,BC294083A50B89DB
23,71C9731001C9C773
24,F63C76EC97E38A91
25,777ED0B1F3CF10DD
26,25B94D808EC232D8
27,A6AED77D365E7011
28,EAE9158BE729E917
29,452AD79BA74CF8F3
30,E3A083E4F64D93CD
31,2EEB9CB69FB6A58D
32,450A96AF1DA8E41C
33,58C01C52768108CC
