stop_order,stop_id
1,8C7CF1C55484A294
2,A3647D99DA65BA96
3,AF61AE97990B5C08
4,4C19E0623146E4F9
5,3523AA15D7F22A3F
6,B9270C10E51D95F4
7,19521C0A1CA93C52
8,72936E1AD7A19462
9,30D564180B68ECA8
10,2EFDB1EADF5955E6
11,E7116B44D9E9393A
12,29740CCBBD82FC33
13,5E6E1289A9CD537D
14,7349A9FC61580972
15,EC1E1868D370F3D9
16,51657C54B75A5304
17,4A91A327C9FC745E
18,39AB774DC35311C0
19,93084A14AE624C6F
20,D17050E8964504BB
21,04DDF4F7F1C74876
22,6BBF595BBAD1DB2E
