stop_order,stop_id
1,16B97B5AA485EE6A
2,85B5527608A0F8A0
3,12DE49878E7A4ED1
4,D92BEED0C736EF59
5,4E56DD827C1F571A
6,8F28FEF1946A7FE3
7,3ABF1C6B0195D580
8,480DB16994F8FFEE
9,F3433105FE5F6865
10,FB9FA7AAA17E9E9D
11,FE56DD70DEDE0395
12,D2217D7746597D10
13,576538E1395C8508
14,1E5EADCD9F424F07
