stop_order,stop_id
1,9C9F817064169CE7
2,8C8191357A7B2C2F
3,7D72DDC29E02C14D
4,132D1A664B715A44
5,F15B04D268DD5C8F
6,C22372B9DAD0859C
7,B45CD55709BC851E
8,9B0A34A1BF585BC4
9,E6D6D7CFDE4D90CF
10,EBA831318619FA07
11,6D5E2E6961E35A90
12,0AAF9F132CE224F0
13,071AEC9DBAFB7032
14,1B3543ED95A64338
15,13E97271E64C885B
16,61F3A30772D0913C
17,2AC85D87661D5AF6
18,D1F2F468672FB541
19,BA2B81A1A81DB398
20,D44F9DCC71251889
