stop_order,stop_id
1,10E07C1870465E91
2,F63D25B428F1C1D9
3,1E471172708B5C5D
4,2479788748627B65
5,9AD30F8EDBC3F139
6,8337F935242C5CC3
7,0D4E07F475845DB3
8,B071B60F5566934B
9,E2602DD1C8EA1AC8
10,620E14F31DA31490
11,32F5F33FA68B77D6
12,0A1DAEAFFDFF0B66
13,3A2924B2461D053B
14,066AA1A504714A20
15,1423FCFF61709EAC
16,898337E6181E5E66
17,4E3FEA4E559A5D16
18,DA17B01A4A61A358
