stop_order,stop_id
1,002585
2,002586
3,002587
4,002588
5,001337
6,001338
7,001292
8,002582
9,001253
10,001229
11,001230
12,001231
13,001232
14,001233
15,001300
16,001301
17,001302
18,001303
19,001304
20,001288
21,001271
22,001272
23,001273
24,001274
25,001275
26,001276
27,001278
28,001279
29,001280
30,001281
31,001282
32,001283
33,001286
34,001333
35,001334
36,002512
37,002513
38,001289
39,002974
