stop_order,stop_id
1,83C4F756489484B5
2,ED9E5ACF98190E5C
3,D7D5410F2F97D682
4,DA87D4887F5FAF62
5,81F1ECC7278CDC18
6,2D36E1CF8C4FF699
7,8316A5C8798768AF
8,96D0ED04D761DBE4
9,B069D9C12F89AAFA
10,E5763322877BB340
11,48769F0B9F6E6C1B
12,93F4EA3D82B33BEF
13,B8B04CD1E568B8F6
14,95797E4D2901A516
15,F9475B6C5F5B9C21
16,B18C8718C0B7904F
17,D1A1DF2BDC842EE5
18,33A7AB58611A0F6D
19,0A1DAEAFFDFF0B66
20,3A2924B2461D053B
21,066AA1A504714A20
22,E615D61C588B8F9D
23,34FBE7E973FE5EF5
24,F5A44B89EFBC0B4F
25,EA3C8544DF22AC4E
26,BC7C325EE59235E4
27,E5E15C5F7F0344AB
28,598F766175BE3EF3
29,CF579AAA2A4E506C
30,F2127FD781019971
31,CED060CB0E89E2B3
32,71B7CB659DF54E28
