stop_order,stop_id
1,B1A047E011F022D2
2,042BAE34F58C8D01
3,7333653B0F4B71BD
4,CA7CE166F4E6677F
5,842DC076B16BE3A2
6,1F1A440137854ABF
7,5A77AE8E12B13718
8,34740DD5ABC36F12
9,25E1BAE2C272ED4C
10,578C11F0F4197509
11,0ABE48106C953AC9
12,480DB16994F8FFEE
13,FD8181D7574BB373
14,F1DE119543E382D9
15,A6013462EAC8AA50
16,DAE9E14BA67CEC80
17,3A5C336CCB38A3FA
18,8CE4B83B45F22F1F
19,D81EA700D73BBEB0
20,CC14CF9E8A163F34
21,CC9AE3EF28E5725F
22,2D30B4FAF44D2398
23,494C28331301B811
