stop_order,stop_id
1,24450906E5F3A75F
2,1E964671BE4EC7B5
3,46CB01C7F12428A3
4,D5FEF340EE98A7E8
5,3FCC00D1D01ACD28
6,3E63535258CAA9BB
7,991E47DBD416B908
8,9274EF6791CA3ED8
9,4253205251F0AB8A
10,E32D979C93E923E4
11,53B170EAFEADDF86
12,42C72FE60B928D1B
13,1C213636264467BB
14,E7B5458F607C3F6A
15,6C5D425EDEE7498A
16,B97CC3668C3AD911
17,EEFA4F8B18DBF2A6
18,CA9E9870D7B2FF36
19,D0FB28B8EED62431
20,4C97BE87FBF959C4
21,FA52803E2628A212
22,0F3FA9B7D07A91F3
23,C837C3C549793472
24,9BE3D659E4C144D2
25,53BB93AAB2D45F3B
26,E057FE733052DDD7
27,B28798C421AB2D6B
28,EDFAC4F35C0E51C7
29,FEC59562CBC99F5E
30,650809D260BC7C6E
31,F81DACC5F39E6D53
32,C3D2BF745570F4A5
33,45924F2D86BEC3B4
34,89D8AA4F45165FB6
35,3CB6A251AF97098B
