stop_order,stop_id
1,0713774B2DB5E4D3
2,9C9F817064169CE7
3,61C957321A4DE4A9
4,E48E4C46F64FFB0E
5,4B5144408E60BF11
6,B651E2A39CD4CC05
7,F734736F35F459DC
8,23B913EACE0581E4
9,C6D5DEF91CB7B581
10,5051A4FF380B1502
11,9E1FC92F86D2F4E3
12,AA239AD010294414
13,284790CC047436BE
14,A80A0719C2068B68
15,8667AD096EEED0A8
16,BA72A994EEF9FABE
17,F8FE29B1FAF8BA77
18,B26245505565A1E0
19,88F986C270B16408
20,1B48082288E30100
21,3C6FA714F5D6EE83
22,2D1C73EF002336DC
23,8A97896E33AED30C
24,54045C861286559E
25,8935A262593E620A
26,E701147EA74E97F2
27,CD077FC371E93248
28,4CEB8ACF469C6AD5
29,0C6879C89662708A
30,DCA166B0A16656DD
31,E24E05B38AA2D28E
