stop_order,stop_id
1,001207
2,001389
3,002693
4,001301
5,001302
6,001303
7,001367
8,001288
9,001271
10,001365
11,001274
12,001276
13,001277
14,001280
15,001364
16,001283
17,001286
18,001251
19,002414
20,001475
21,001769
22,001547
23,001548
24,001552
25,001801
26,001426
27,001429
28,001430
29,001687
30,001434
31,001685
