stop_order,stop_id
1,5527FF8CC85CF139
2,D13C7436B13B4A4B
3,E0BAA3364D0CE860
4,015AD27DAC83E698
5,BBDFF2D05E37EE61
6,52AE04E9C3E77BE1
7,8570495BD7C63C02
8,0A87C29A2B460C96
9,ED5554C57CF0061C
10,4D9419874306D82F
11,D625B0997C3DBCFE
12,D7EDDEA5A942843B
13,A7F679945ED1DB31
14,300D1812E3A085C3
15,A5C65B0A68257CF1
16,99256D08CF861BA5
17,D0A763AFCDE36124
18,E6ED785726AED4AE
19,15FCDE0753176016
20,098AF67CBBB9FBA9
21,E3B464760B6ADF30
22,C91F41CD18797652
23,2D30B4FAF44D2398
24,77CDA845262FB8CF
25,6571D5C2A2184B8D
