stop_order,stopId
1,307
2,117
3,118
4,120
5,274
6,187
7,126
8,122
9,276
10,78
11,79
12,80
13,81
14,185
15,76
16,90
17,94
18,279
19,280
20,282
21,283
22,284
23,286
24,287
25,288
26,273
27,83
28,19
29,20
30,21
31,22
32,23
33,24
34,25
35,26
36,27
37,28
38,246
39,247
40,248
41,249
42,250
43,251
44,252
45,253
46,254
47,255
48,256
49,257
50,258
51,259
52,260
53,261
54,262
55,263
56,264
57,265
58,56
59,266
60,57
61,305
