stop_order,stop_id
1,A54B523A325432E8
2,ABC15E2110BF7A49
3,BC66863007C0592B
4,848CA90EB0DB1146
5,7486D53F341F1AAC
6,C73A03D6C468B767
7,FFFA7F14EBC1BB1E
8,0246D8407B61118D
9,24627F9D79F25721
10,4D30DF225016CBB0
11,883E42D32C6AD101
12,5BEC0CCDD7EE4A8C
13,42C6BA7F38987023
14,A75AAAA36A33C563
15,3EF537320681EE89
16,E0558D2901ECC032
17,745B539CC1A71251
18,DDAA6CA9D68D3BA5
19,DA2677E4FF848D7C
20,5B0682EF0C8397A2
21,78277EF9D0189DED
22,6A2B162370C1EA01
23,EEBF538FE7455434
24,93D084D7713119D8
25,9B01BEC701652627
26,3225E407F87D904C
27,4395252CFDC7AB1F
28,8CD39F19DD49D504
