stop_order,stop_id
1,0132863D9F66CE6B
2,1380D71251D0CBF9
3,B85E71E9AFF5B087
4,D78B86AB419E84B3
5,F81DACC5F39E6D53
6,C3D2BF745570F4A5
7,45924F2D86BEC3B4
8,31005C82D70F6B09
9,F8C20FE9111D486A
10,396DD38F2E41E117
11,98EBAB9468C80DD2
12,6DD6B837EF1FA76C
13,AFD29CB1A4F71AB9
14,65ECD19EFD09FB74
15,0E41E02CD9055626
16,EE81A30BE4BDC8AC
17,F4176942E449DF32
18,39AE60AD7BADCDAA
19,A4837AB15400D744
20,37E653F1DC727EB2
21,CB295B56D3762A1F
22,F8B3E5A11921AD1B
23,C66CDE62B5AEB8DA
24,832EFD8F5165814E
25,F7670D87C1847D31
26,2431FF3100478DEE
27,ED6FCB0422D541F5
28,850F72123F644500
29,3821D64D2BF1BB66
30,66C6FDFC88F56E51
31,7CD8F96A087CDDF2
32,032C7D86DF9ED3AC
33,CB0A7FCB95D381A1
34,B7F8CCEBD9365739
35,C8CCB9570EAF652D
36,31CA1CAC1718F2B4
37,1E10D70B8D3AC179
38,A63B90588F747496
39,C0667F887514F03F
40,DC5AC2E3C1153288
41,28B264A688848238
