stop_order,stop_id
1,494C28331301B811
2,5FBC215F6F58AC98
3,7B3074F34B2D6D01
4,98AB21EAFF27FE09
5,0D7B059BFF6CA5E2
6,8D386F5D210C3439
7,A80D9E7FA0C070E6
8,32CCEDBCC9EAAA9E
9,2751781A6F757C5D
10,6045969736940272
11,38A53BACD13CD0C8
12,C4F65410A7A2E8B6
13,1E58DF8CAD59712E
14,8CD1D697477E50D0
15,F6E296480D3481A2
16,25455FDE268CF605
17,C1AFF00AC64F457A
18,5396072459507B7F
19,C048D4CF6ED36C7A
20,68A8F08ABC5C90F0
21,91929D42214F3D7F
22,97B7EC0354E020B7
23,ED03E689B88CE0E8
24,438AFA4E9E76C953
25,ACFA28064D1B2380
