stop_order,stop_id
1,001382
2,001384
3,001312
4,001226
5,001344
6,001309
7,001306
8,001307
9,001301
10,001302
11,001303
12,001313
13,001464
14,001649
15,001607
16,001608
17,001645
18,001609
19,003537
20,003611
21,001811
22,001812
23,001813
24,003538
25,001534
26,001535
27,001536
28,003536
