stop_order,stop_id
1,ED380ED65FFA508C
2,015AD88813C61900
3,B88E6F52E2BC2E34
4,3FAE59A79C8BCC93
5,A1D3216AF158C117
6,2560149CE75EABA0
7,CA6AB8446B694566
8,D893FD9E88E2A98D
9,81C7DC25FD107DD2
10,0653C07D043A0E97
