stop_order,stop_id
1,07A21E4B84A401AC
2,BC50F731DFC77A7F
3,3CB45560769AA11A
4,97E8669AA68FB093
5,AB10F01039440464
6,354A2C15BD189228
7,5AF593F7A11180E2
8,A8430DB27637D95F
9,12E6D91298FABAEE
10,DFE346B2C7332BC0
11,88229183EDC0B6E9
12,D010FF7CF77383B7
13,F4D9335688592803
14,44EE4F1DEB9ADD69
15,640B42B50FB0152E
