stop_order,stop_id
1,C57D642E9E6A0B52
2,520C9836ACAECDF9
3,22FE13158B36FE48
4,67064412B0E9D9A6
5,242DFDBDBFA2034A
6,E05F8589B0529DE3
7,44CE8904990EE28C
8,EB9E9B5EEE20114C
9,0BADB28A19C2E0BE
10,44EA73AE2E27AC12
11,B4F2BAAED2470D0A
12,75C0DF6C7724CEEA
13,EBF4EB34B96BC242
14,3FE93821145B65F5
15,D2EF3E1D638B1B9A
16,3972A3F0E991EC16
