stop_order,stop_id
1,25BD7B50919AA221
2,AB057A63C24E990E
3,68106C827BF891AB
4,20D0C9CBE2BC9451
5,EBB057754E3423CE
6,A8E63F70F386C05A
7,E173F2DA030C6AAB
8,6E2A7A2CD29F9216
9,30FEA8A7071EDE48
10,557B9185722A07DB
11,DBAAC5A97DAFD138
12,6A6E44D4207221C1
13,6156B488BEB726C6
14,A8762A74241E8027
15,667FDF4DEF4D2BAE
16,63B3694BF40FBEC6
17,F54744E6F5CDBC1A
18,7605CC9BA97A5F61
