stop_order,stop_id
1,BF152164ABD4B7A8
2,05FE00A97E0CF001
3,24078B675A7FE3B3
4,DBB8E01BBE8C66ED
5,7DF092F3A5418694
6,364754E2273129B7
7,FE6D5955F777E39C
8,0879D399E5B5FE0C
9,6118B186F901485A
10,6246D82DAB57582A
11,84864BD3AA42BECE
12,AB52CEC256B299BE
13,156FFE36D7D42EFE
14,65F5585B72A99D7F
15,94BA372E9FDC87C4
16,A6631CAD2E2DE2A6
17,84FC122EC64D8885
18,04EA3349BDD260C8
19,225D34B4D891AFB1
20,AFC8501FD7ACB2BA
21,4879E9A72E1C5518
