stop_order,stop_id
1,F7E9B87F47F0A3F9
2,27CD14DCDF87F746
3,D024B008AB77435B
4,40FF132FB8E77051
5,B08CA4B3CDCF142A
6,72155034783E2E96
7,6C6B36F7550907CE
8,47266DB98060A64E
9,179C182ADEF1070D
10,D39533060940818A
11,14894C859FDFE8C3
12,7A95C545D0393126
13,5CCBD9A6B58BF20D
14,A37F8CF766FCF9F3
15,EAE9158BE729E917
16,D2217D7746597D10
17,0840B3F75A7B00BD
18,C175ACB534E8C15C
19,E46A9F0C0CB609F5
20,E45CFAB2E6E4C8FE
21,AA97FFC49AE957A5
22,BE27F066CF40DF7D
23,07521BB848913F74
24,3CE7B5D1EBF9C5F7
25,38B86AC474D1060D
26,0B8C52E4C34E3B64
27,144E9479168069DD
28,F36C1B3AC57D96FA
29,B1B0E08245C0FC15
30,C84DC1927320A4AD
31,0F9D050D4229C0F7
32,19171A194D7507D5
33,AFE8CE5FCE951B89
34,BEFAD7DB0A750CDF
35,A3B11321D2A974B2
36,0F5E58C7890F7A70
37,F7E9B87F47F0A3F9
