stop_order,stop_id
1,003415
2,002434
3,002435
4,002437
5,002574
6,002535
7,002512
8,002513
9,001289
10,001346
11,001347
12,001238
13,001328
14,001329
15,001330
16,001391
17,001331
18,001212
19,001211
20,001250
21,001208
22,001234
23,001235
24,001236
25,001237
