stop_order,stop_id
1,001333
2,001334
3,002465
4,002410
5,002556
6,002474
7,002554
8,002439
9,002440
10,002441
11,002443
12,002446
13,002449
14,001140
15,001142
16,001054
17,001056
18,001175
19,001040
20,001066
21,001067
22,001068
23,001069
24,001070
25,001183
26,001003
27,001005
28,001164
29,001152
