stop_order,stop_id
1,003660
2,003661
3,003663
4,003664
5,003665
6,003666
7,003667
8,003668
9,003669
10,003670
11,001986
12,001463
13,001278
14,001281
15,001283
16,001286
17,001215
18,002457
19,002567
20,002442
21,002444
22,002445
23,002459
24,001033
25,001178
26,001196
