stop_order,stop_id
1,494C28331301B811
2,1DE77C91B7ED381E
3,7B3074F34B2D6D01
4,98AB21EAFF27FE09
5,099E9950742D6414
6,1A85B99EDE6D01D8
7,04FC6E130D4953F4
8,EEBBD352B7F16E3F
9,01E580BD435E9301
10,B4F2BAAED2470D0A
11,3F21ED54F86D9B1D
12,BA4AAEE586402CD4
13,91481C9100917BA7
14,40829C12642639D4
15,16A7F2C343AA6DE6
16,4B0E21EDF07F9C83
17,1CF4AE2F7045B848
18,1B4B4E62514B9043
19,857F6F958A96DCDB
20,46D02E1C1CD82C9A
21,1E04D9D97DE148C2
22,4B5F39DBC6671C81
23,B1A047E011F022D2
