stop_order,stop_id
1,90A65F742FE7D728
2,B8B04CD1E568B8F6
3,939FE9A08B99174C
4,CAEEAD91F339D3DA
5,20E8B4520A802912
6,E368E68412AB685C
7,CA793BE80FF68AE2
8,C9E264A3F9D4CEB3
9,094D2EBC017EE61A
10,8C6EF1266E4EE05B
11,257A6E19DD7F156C
12,28A57C043C111604
13,E00E92F19002ED3E
14,DEDD6247441C8C05
15,81B719F7DC3F0FAD
16,05EE261A65F9B7ED
17,142BE7225B0BB745
18,AFC5E64568DBB2D5
19,ABFB3F43ECB908B2
20,C1E9F8237EDBBAD2
21,4BFB5F2D496CDA56
22,8F6FD66CC20690DC
