stop_order,stop_id
1,A371827CA951848F
2,F139E189918C1F86
3,52B02EAC7AAB23C1
4,3F6F5DC1DDA5F68E
5,242122B5F1B7E9C0
6,6953AEF8B3921959
7,CF2FE4F019F51438
8,620E14F31DA31490
9,26D2833891C00F40
10,0A1DAEAFFDFF0B66
11,3A2924B2461D053B
12,066AA1A504714A20
13,1423FCFF61709EAC
14,898337E6181E5E66
15,9217F5E1950F12BF
16,9985A4A51DFA3079
17,45A499CD3132E90A
18,434BB67EF7BCA912
19,B596DF51C1BDDB19
20,7FE0FCDBF45276EF
21,7D41FC4EE12CB8FD
22,9CF00A30796B6B2B
23,FB948853081A003E
24,4C5AD92665CBCF5D
25,29EC0D6F48E5BCDA
26,4242A06B3D8849D9
27,DB0C71DA23871216
