stop_order,stop_id
1,001249
2,001279
3,001281
4,001282
5,001286
6,001215
7,002439
8,002404
9,002470
10,002348
11,002358
12,002160
13,002161
14,002162
15,002163
16,002333
17,002334
18,002335
19,002336
20,002339
21,002341
