stop_order,stop_id
1,001207
2,001301
3,001302
4,001303
5,001367
6,001288
7,001271
8,001365
9,001274
10,001276
11,001323
12,001464
13,001649
14,001607
15,001608
16,001645
17,001609
18,003537
19,003507
20,003611
21,001811
22,001812
23,001813
24,003538
25,001534
26,001535
27,001536
28,003536
