stop_order,stop_id
1,001808
2,003269
3,001803
4,001804
5,001537
6,002414
7,002348
8,002356
9,002358
10,002160
11,002161
12,002162
13,002163
14,002261
15,002328
16,002320
17,002329
18,002696
19,002391
20,002392
