stop_order,stop_id
1,633A3F4B4A5637C2
2,C78818C8285315B3
3,5298A15B8CCAEF42
4,A9069A17B1474D76
5,3007D34FB91FB27E
6,1AB934EFE0E1470A
7,048A87496B30B946
8,FD9F24DFA3090351
9,64FBF17E3209D217
10,4A626ACD36F8ED7A
11,79AFB35F9DBD485A
12,D5DB45916FCE114A
13,5D94D3084F0C3831
14,89A4D25AC31A8388
15,6465986EF7824816
16,C53A00F15DC2DB20
17,48E5A1EED91712EE
18,8FE9357F36300CD7
19,B8E2647E9C5019C9
20,AAECA769A84E2372
21,A66159E033DDEA04
22,C92E80A5D7E0E8EC
23,07ADFF84F3502690
24,B9EE83CA8ABB578B
25,50F2B96452F78F19
26,1AE43A670EACECB1
27,C0D515CA78A56B65
28,3C624F6CB2D5BBEA
29,C1E9F8237EDBBAD2
30,4BFB5F2D496CDA56
31,EF15FBC5E8A02ADA
