stop_order,stop_id
1,C8649AADD889000A
2,25B5D45256839700
3,F99B2D48663A322E
4,38CCA601583A5C55
5,6AEE9093F4E070AD
6,6953AEF8B3921959
7,68D96D087701F3A3
8,024D478CE8AC52F3
9,613ED01D077362A9
10,66B8F73D3F4E91C9
11,8EE5AC5D519C140E
12,5221837D08C7B586
13,C8649AADD889000A
