stop_order,stop_id
1,4DA3813D3CE3A5DF
2,015AD88813C61900
3,B88E6F52E2BC2E34
4,3FAE59A79C8BCC93
5,A1D3216AF158C117
6,D010FF7CF77383B7
7,F4D9335688592803
8,C192BEF2264E0CC6
9,542CC0EC83BAEA01
10,840532B7C95DF870
11,2F5F973821A594A9
12,B491EC8833D9928B
13,90CFA838B3C95AE0
14,C2B20556AB5A2C1C
15,580D52F4D93CAD9B
16,3199543D3AE70527
17,BDD49A91FF705B42
18,8C32D9DDB85891A6
19,5238463F47B490D6
20,C1BF4509359B0895
21,2D3D025684145373
22,07B714029E91FD81
23,913F2DF20E573CEA
24,CA6AB8446B694566
25,F2508598F5A43655
26,1E5EADCD9F424F07
