stop_order,stop_id
1,1064E673770C38BC
2,2DFE2D85D53C1114
3,C4E03BB27317AF35
4,30DD3451F8D64883
5,8AFF8B43EC3E547F
6,6B2A3162063E2B8D
7,ED9E5ACF98190E5C
8,D7D5410F2F97D682
9,DA87D4887F5FAF62
10,81F1ECC7278CDC18
11,2D36E1CF8C4FF699
12,8316A5C8798768AF
13,96D0ED04D761DBE4
14,B069D9C12F89AAFA
15,E5763322877BB340
16,48769F0B9F6E6C1B
17,93F4EA3D82B33BEF
18,B8B04CD1E568B8F6
19,D8F172EF79F3414D
20,CAEEAD91F339D3DA
21,20E8B4520A802912
22,A60AE774B09A5E44
23,03D5CB9EBB6602B2
24,81B719F7DC3F0FAD
25,9E8E99C5BB698AC2
26,61BA8F7170CDFFD5
27,437D60C455A624E6
28,A23337DAF4A8B168
29,72EE8A033E4260A3
30,61A21B70C10E9722
31,1772336D72B10178
