stop_order,stop_id
1,003370
2,001610
3,001611
4,003036
5,003046
6,001657
7,001656
8,003458
9,001509
10,001510
11,001518
12,001519
13,001463
14,002417
15,002421
16,001074
17,001053
18,001184
19,002735
20,001027
