stop_order,stop_id
1,FC19ABA503C5FE51
2,5C1471822EE10AF3
3,DFC05AAD7C3913C5
4,906F89BBA32AEF7E
5,34F421B30D4CBFF5
6,BB5C1DCDD6B2BC9D
7,C539A7A9365F64D0
8,51B7D1F60A5BA724
9,4BD11538EEA40F55
10,22186D34914B7805
11,073E1DD8599E7315
12,41FA91EC4FFF5A19
13,0DCC18C3A018C1DA
14,75767448DA6FA081
15,4073C7B5B3D72456
16,153D32217234A0F0
17,893BBB901005C3E6
18,BBE77B90CE43AEFA
19,3A43E432D0588F79
20,0F4F935A9F14F111
21,E20D7A733ECDFA05
22,557B9185722A07DB
23,BE510511B0A7344E
24,A2E2FDB1428AE8AE
25,57ED9CF67F4D6AC4
26,D81EA700D73BBEB0
27,CC14CF9E8A163F34
28,CC9AE3EF28E5725F
29,2D30B4FAF44D2398
30,494C28331301B811
