stop_order,stop_id
1,81567ACCCF40DD4B
2,DC2FFD02E8F541A8
3,5E6930E95AF84C94
4,1221E26C45F978B1
5,FFFB0F940CA7BEA7
6,14157BA5C06B0B6B
7,605B05317A40A2A4
8,78AD2432201EF5EE
9,1B0FD9C27F5FE0BE
10,A010FE2C473103A8
11,70FEB409760C77EE
12,E0E2097354500456
