stop_order,stop_id
1,AF020613AEB25447
2,DCB96F7AF6EC5EE7
3,FF9F7715ECEDAC41
4,A5C1234F60BBF1EB
5,A58C8BBBEC70CEC0
6,1B89F83BD1FC3F74
7,E68FF6CC803A14A2
8,620E14F31DA31490
9,32F5F33FA68B77D6
10,0A1DAEAFFDFF0B66
11,3A2924B2461D053B
12,066AA1A504714A20
13,1423FCFF61709EAC
14,898337E6181E5E66
15,9217F5E1950F12BF
16,BB04686A2E0D7578
17,952DD8539E6DAC75
18,E3AB394138EDE467
19,F275A85A9CF9BBC4
20,FA343B97309B84B4
21,E7E5E3C1F761966F
22,062B0243536F0816
23,13B39CD775874ED9
24,08A97AD10693B841
25,42E5CC0772775C7E
26,1D75CC7D0B671EEE
27,79BB89DA868D93CF
28,BE47845FF3E717FC
29,16F732FAF7057965
