stop_order,stop_id
1,B2FCC11A86792139
2,4CE0325AE0DC6957
3,B4D3F2936EB79DF7
4,B97DD1419E4BB86E
5,210CF8389F782535
6,2F390B21000CF215
7,A15EC70C910B44CD
8,2E0AB36307ECA231
9,6E3DDCA31C3CC1FA
10,A4A4296E3ECFA98C
11,362808DBFCB54055
12,312CD2A987AA2773
13,98FCC750B322B706
14,BC294083A50B89DB
15,38CBB6C76211934F
16,F63C76EC97E38A91
17,777ED0B1F3CF10DD
18,EDF107F1315D6805
19,77BFE3A169866C7D
20,EAE9158BE729E917
21,D2217D7746597D10
22,576538E1395C8508
23,1864222D8939BD69
24,65194DB76048113F
