stop_order,stop_id
1,001363
2,001333
3,001334
4,002465
5,002554
6,002440
7,002442
8,002444
9,002446
10,001141
11,001142
12,001055
13,001056
14,001058
15,001193
16,001628
17,002862
18,002863
19,003355
20,002864
21,002876
22,001595
23,002865
24,002866
25,002867
26,002879
27,001639
28,002593
29,002882
30,002891
