stop_order,stop_id
1,1E5EADCD9F424F07
2,9CAF2FDA35EEF9E2
3,4A38244491180BF7
4,5419928D472EAD8D
5,36DD78B37B828DD8
6,D7C7D86E923EEAE1
7,16F899DA5289900D
8,DD161A7AB0D39192
9,3F21ED54F86D9B1D
10,7EC5C567E35D2805
11,61BA8F7170CDFFD5
12,D137ADD65D333E0B
13,437D60C455A624E6
14,A23337DAF4A8B168
15,72EE8A033E4260A3
16,61A21B70C10E9722
17,DEAC83FBE72FE09C
18,E9B13F8E482054DC
