stop_order,stop_id
1,001207
2,002770
3,001216
4,001217
5,001317
6,001318
7,001319
8,001320
9,002783
10,002784
11,002940
12,002941
13,002942
14,002955
15,002943
16,002944
17,002954
18,002945
19,002946
20,002939
