stop_order,stop_id
1,5774E63B634C0B1E
2,5B04604E989BBDF0
3,1E3A342DF7D5B8B5
4,C9A46DDC082BAEE0
5,ABF9301D1E5B52ED
6,266A4CDA19461A42
7,8C79BE154468AE21
8,26A996F589C84844
9,F374B56E275194D8
10,AD0B5EFA2471962C
11,A7BA13A9AA331D97
12,48D7576D3F243169
13,9274EF6791CA3ED8
14,14BDB94A8F3ED3EC
15,D0FB28B8EED62431
16,C7120BD9A94B4F6A
17,825199DC3BC0C5A3
18,ADB9356BBF06F7C7
19,8E3F5AE0A97053F9
20,F8D7946AFDBA377E
21,57E8A522E2C638FD
22,9170FC8FFFD12204
23,C3D2BF745570F4A5
24,B986375ED4762DA9
25,A7C1A969F48B62C0
26,D2C1DACCC74B69C5
27,4442A9A5E7FABAB8
