stop_order,stop_id
1,D2EA32ACC919A9EA
2,E3B77FDA167AE325
3,3C9E0D9FBEA28AC6
4,952DD8539E6DAC75
5,E3AB394138EDE467
6,D597E0A9258D0894
7,FA343B97309B84B4
8,E7E5E3C1F761966F
9,062B0243536F0816
10,13B39CD775874ED9
11,08A97AD10693B841
12,42E5CC0772775C7E
13,1D75CC7D0B671EEE
14,79BB89DA868D93CF
15,BE47845FF3E717FC
16,8BCB786E1F1A2457
17,5CF51F3B971D4D56
18,AAB25066B96C6588
19,8CE4B83B45F22F1F
20,89F6B64B28A21D34
21,18A85DD43DFA12AF
22,8D386F5D210C3439
23,DFD51C2C47E6692C
24,AB3C556B2A18F0DB
25,3500D60BFEFFF7BC
26,417C996BA7F5F59F
27,6D1F582245EC568B
28,6C9939568AAA34EA
29,5D3B3AE3CCFDDA96
30,3E752B45D12458EF
31,A5A6FF8443523FF9
32,FD1B403FD4EC3E8D
33,4E42234F86ABC6E3
