stop_order,stop_id
1,38F4F6A39C28DEB5
2,8BAB6AA783EE0508
3,7380707A36C032B9
4,52AE04E9C3E77BE1
5,C2AA10A9751D3692
6,5E1B227D9FAC4267
7,DB42B6238F75CF3C
8,917DF4AF0ED7B258
9,7FB952821E3FCAD2
10,DB6981B82045B45C
11,ACE23D880D07ABB1
12,1DA57A1376E99AC6
13,839276ED5C3F4F4C
