stop_order,stop_id
1,55E3A1A6E995A9CB
2,EF43A73D4C0CC508
3,BB4F24A4C6A9B222
4,F61DB78CF72DB387
5,92A09EC9B712A1ED
6,4885700825A72F51
7,A1541789F09C89BA
8,D073CC71A1B4F79C
9,B64EEA7F564C7853
10,46D1A9FD1F84CA5C
11,BDD49A91FF705B42
12,6FB7BC1E5BC1E4EE
13,CBBF3CAABD86AC14
14,C2787E27F82716BF
15,F5A44B89EFBC0B4F
16,EA3C8544DF22AC4E
17,C847B9021C407731
18,5536C9E3A0CE1228
19,A15FFC3149FB92A0
20,5D1E6432755E4F5F
21,D80313EC29620E1D
22,BA03816A38B9DA7F
23,D0F8772D043C207E
24,E5E15C5F7F0344AB
25,598F766175BE3EF3
26,5FE12AC5660F89D6
27,5AAC6A858427D04E
28,F36C1B3AC57D96FA
