stop_order,stop_id
1,091B6BBD766C0181
2,DB0A398B6B890051
3,D52D3F3FB66EF61A
4,85B41FEDE6611826
5,D6E7412666B1175B
6,AB87BD2749FFEACA
7,43398296F1D1BD48
8,65D1B50CC2E45985
9,67F3E54FF145BA65
10,F02CE37AD01DF17E
11,AAAF715A5DC3A7CD
12,7192051038B36F08
13,0CFB814CB6C356C1
14,CA60760D2303E6D0
15,DE99B27530D1A3C4
16,A25160BA84EE09F7
17,7467287ACB876529
18,091B6BBD766C0181
