stop_order,stop_id
1,40D067F126426DC6
2,AC8828CF13B8AA49
3,8864CF7D3E4B1EF6
4,BE27F066CF40DF7D
5,07521BB848913F74
6,5D8FCEF2915882FD
7,C2605DED84199B84
8,38B86AC474D1060D
9,0B8C52E4C34E3B64
10,144E9479168069DD
11,DA0947682FC19B0B
12,2EF9764BE18FC290
13,FF6E49051D6D9A8C
14,7A95C545D0393126
15,5CCBD9A6B58BF20D
16,4DB8054CDFBB9E43
17,40D067F126426DC6
