stop_order,stop_id
1,002202
2,002203
3,002205
4,002204
5,002262
6,002263
7,002170
8,002172
9,002173
10,002210
11,002211
12,002212
13,002343
14,002383
15,002347
16,002467
17,002437
18,002555
19,001213
20,001259
21,001260
22,001261
23,001263
24,001264
25,001464
26,001522
27,001521
28,001739
29,003233
30,001496
31,001498
32,001500
33,001501
34,001525
35,001472
36,001453
37,001469
38,001526
