stop_order,stop_id
1,C20893EE82D32C84
2,DB11DC6D1BA11F9A
3,F5FA7ED5D5A6860D
4,D05C7D74301D47C5
5,41C9D989B8B874FF
6,189AC37A164008A6
7,D127A33746CCDB16
8,9B664F8FD4E76E48
9,20E8B4520A802912
10,80EEE299A75B7F1B
