stop_order,stop_id
1,E909A45B1FB3213B
2,EA74F13EEC20AD91
3,3502ABD7492B8C56
4,B20A1163984772C9
5,8D47F8C7AA27FCB8
6,7AA3F7F89AD36B1B
7,180648AA12CF6725
8,7525EA3D297065CC
9,131A8DDFC3837AD7
10,BC3E701090D7E56E
11,8DDFE8598C7DA354
12,8A0B04DDC3B321A4
13,076E1AA3258C5D0A
14,2FE9CA5CC344B5A3
15,AEE5D5FDC38650DB
16,B1E11C753EE8DC31
17,B3CCAA9D93647348
18,2D7EF40DC9C35085
19,5CB3827F92F37568
20,56ECE6365B40EF35
21,475B0D727574F7B8
22,77C4E5A2A47DD342
23,042C0E83759B8B21
24,D65ADB261B3B4BFB
25,B0562915C29036D8
26,A9F94ED7238542F5
27,3F2DD4E3E4A5CCBB
28,AB4FF374DA182B02
29,131A8DDFC3837AD7
30,D5FB5BA7E9E89E5A
31,41C32F27390D0EF4
32,3D29F886079F85E9
33,7CFA6F0EF3D764C7
34,8447E71E45CE5452
35,083D8BB713878707
36,6D76943277DC18FF
37,4EBE182141C52094
38,E909A45B1FB3213B
