stop_order,stop_id
1,24450906E5F3A75F
2,1E964671BE4EC7B5
3,46CB01C7F12428A3
4,D5FEF340EE98A7E8
5,3FCC00D1D01ACD28
6,AD1B202B678A3B56
7,C88DEC0AF0D1102B
8,B241331CC87A36D4
9,B4F3F0D547580CE2
10,F1A22B170518051B
11,3DB9E473F29FCDEE
12,84C5EBC00642536A
13,42E86F97FAC8F719
14,F948129B464BB963
15,79AFB35F9DBD485A
16,CA9E9870D7B2FF36
17,D0FB28B8EED62431
18,FA52803E2628A212
19,0F3FA9B7D07A91F3
20,C837C3C549793472
21,2AC85D87661D5AF6
22,B6C8902A10BA6EFC
23,000CFEE2F92DC17B
24,53BB93AAB2D45F3B
25,E057FE733052DDD7
26,1380D71251D0CBF9
27,B85E71E9AFF5B087
28,D78B86AB419E84B3
29,EBE1766B508217AF
30,EE775A73D626A46E
31,D417A444017171C6
32,3CB6A251AF97098B
