stop_order,stop_id
1,3917263246285F3E
2,36C3B12BD3112CCB
3,E083D2189A733B79
4,0269A1F9D98C737E
5,47FF0EDCD6926932
6,64312A5DFF11636C
7,CB2A65E69B2B71BE
8,59081A58EA5BC728
9,5D14B75687F60509
10,79D68EE7C6CBAB9D
11,A6A60ADA171EE7C8
