stop_order,stop_id
1,F718BAC64885E69E
2,C95751DB2112F279
3,F7AD8DE682AD5BB3
4,54BA046B2D0297A0
5,51E196E962453AB4
6,D2EF3E1D638B1B9A
7,86D7BB9BA055D8A6
8,C24776F20FE877FF
9,257A6E19DD7F156C
10,28A57C043C111604
11,E00E92F19002ED3E
12,DEDD6247441C8C05
13,81B719F7DC3F0FAD
14,9E8E99C5BB698AC2
15,91481C9100917BA7
16,8ECFB7DFFC0023DA
17,739A5DDE0CF1970C
18,9E95343C77BB85E2
19,F808AF482CCA028E
20,9C6800DD6E0CD683
21,6E821768CA09E8C9
