stop_order,stop_id
1,26AC2D471648CA0C
2,F88EE882E4B77399
3,CC13DC33AE269FB1
4,4E870B220826BEE0
5,5AD2A4D21C226335
6,A454170B2B59B587
7,D6E7412666B1175B
8,AB87BD2749FFEACA
9,43398296F1D1BD48
10,67F3E54FF145BA65
11,F02CE37AD01DF17E
12,DFB7FD5832A4BA4E
13,3406C1A9DA760403
14,A3D1F413719E60F1
15,B085DDE8E381E370
16,DE99B27530D1A3C4
17,A25160BA84EE09F7
18,2111E15DA3CEFEC4
19,952DD8539E6DAC75
20,E3AB394138EDE467
21,F275A85A9CF9BBC4
22,FA343B97309B84B4
23,E7E5E3C1F761966F
24,062B0243536F0816
25,13B39CD775874ED9
26,08A97AD10693B841
27,42E5CC0772775C7E
28,1D75CC7D0B671EEE
29,79BB89DA868D93CF
30,BE47845FF3E717FC
31,854BC3A8D4DE6AA9
32,65DFF8BE0574FB35
33,A19F3A433556AF0E
34,70AED81BA5AE0B49
35,0C82A7979D96D1FD
36,FD43CB63B7E560F6
37,FE5036CCAC908A19
38,5CCCA68A757E79D4
39,C5AA13924C99532A
40,A70DCB46EC98F43E
41,7B98BAE3D93817AC
42,14F176D358D65A8B
43,8E3A5C15E42020BB
44,97CE87CF035B0E10
45,96442B84082D4DF5
46,80752DC190FABC6C
47,E10A0960D4E103B1
48,FE56DD70DEDE0395
49,1DEB855D55528B03
50,11A1269F9B78F269
51,0840B3F75A7B00BD
52,FE4E099AEA040C89
53,E46A9F0C0CB609F5
54,F656A38D2A40F77D
55,3D040EE809057C6E
56,430B9D9C6AFF364D
