stop_order,stop_id
1,001419
2,001420
3,001589
4,003148
5,001542
6,003149
7,001543
8,003150
9,003151
10,001546
11,001817
12,001547
13,003152
14,001551
15,001553
16,002716
17,002717
18,002718
19,002875
20,003061
21,003062
22,003063
23,001572
24,001573
25,002976
26,001829
27,001503
28,001504
29,001505
30,001509
31,001670
32,003595
33,002913
34,001821
35,001778
36,002906
37,002933
38,003477
39,003473
40,003160
41,003225
42,002919
43,002928
44,002929
45,003329
