stop_order,stop_id
1,D44F9DCC71251889
2,3582449B6BBC72AB
3,13568DBEFE3503A6
4,87F9F165B63331A5
5,540B42AF095A342C
6,15B81103A046F072
7,353E3CFF9A54BF67
8,B763C84D964B44BA
9,9D388587636920DA
10,861F3C638550D22F
11,1E74023B27721B91
12,C714D6DAAC9C9719
13,D6ACD5E94F9E6DED
14,3FBF0DB2F9B1524A
15,6E5347AB1990F94D
16,2DE55F5F52F8A3AF
17,D926EC9FC8BCE6BD
18,564C0ECAAC09C371
19,412DEEF534E127AF
20,AAC64BCDD5B55A86
21,C552CE565E1F0C85
22,0D5759F7A4B185FE
23,3250A722B6084CC8
