stop_order,stop_id
1,8D6792FF38584BE0
2,015AD88813C61900
3,B88E6F52E2BC2E34
4,3FAE59A79C8BCC93
5,A1D3216AF158C117
6,ED364A58F885DC92
7,5941DC3E9FA7BE8B
8,85B0E39398B91605
9,1F934873940D1F49
10,AAB411C52D067AD1
11,6ED65F69CDBFDEB6
12,0E65D3EC41A1D34B
13,4E3FEA4E559A5D16
14,DA17B01A4A61A358
15,876D631AB4D87514
