stop_order,stop_id
1,001700
2,001672
3,001726
4,001727
5,001754
6,001818
7,001819
8,001820
9,002917
10,001778
11,001728
12,001751
13,003589
14,001494
15,001495
16,003575
17,003576
18,001649
19,001607
20,001695
21,001690
22,001524
23,001761
24,001765
25,001725
26,001853
27,001876
28,001878
29,001880
30,001882
31,003452
32,003453
33,003454
34,003443
35,001874
36,002589
37,001870
38,003566
