stop_order,stop_id
1,0A3466DCC6F4196C
2,0B8C52E4C34E3B64
3,144E9479168069DD
4,7459D3AB11AFD6B5
5,9C839C3824F47A6A
6,CB4BB0008A87E4FC
7,40FF132FB8E77051
8,B08CA4B3CDCF142A
9,CF18D17DE7B40350
10,736E84A8060D2AB9
11,CB4B52222877C32F
12,6B9496267BEFF02A
13,5ACB622335DF5AE7
14,B7082198F517B1E8
15,AA52228890817D12
16,D9563FD5B8CB0CEF
17,6410DDEFBBD17426
18,716E5DBD24DCE28B
19,7B9D5D0407DB14D3
20,BF4620B0CD0B9D45
21,A0AB9A2B2D648FF5
22,484F835517494767
23,8F5CE1219E502C17
