stop_order,stop_id
1,1001A444985DA59D
2,E70EDF92FE8553E2
3,D52BE142BBBD69D9
4,2C7BF1ADFCFB5545
5,671775E6AF279B42
6,4B17C55C032D3A37
7,266A4CDA19461A42
8,99D25E17B32126B4
9,DCC8F8655EB76754
10,AA6F0A2661759A49
11,1DF17F085C6C1B78
12,7917BB962CCB11C0
13,E435F72ACB8438ED
14,60A445D9ACD40C12
15,118450CCC68E42C6
16,6AAC8E541D9BD80C
17,643D73028E9E8490
18,E481F7170B1F6FC3
19,14157BA5C06B0B6B
20,CCBBE2779B1765C4
21,74C51A8A3D783F40
22,0E2B8E1D544C6889
23,A010FE2C473103A8
24,70FEB409760C77EE
25,1C0A89BD67A4CFF0
26,6723518D536070AB
27,F7EA40235ECCBA38
