stop_order,stop_id
1,002223
2,002390
3,002357
4,002358
5,002160
6,002161
7,002162
8,002163
9,002261
10,002226
11,002227
12,002228
13,002229
14,002230
15,002231
16,002232
17,001109
18,001110
19,001111
20,001112
21,001113
22,001114
23,001153
24,001062
25,001063
26,001064
27,001065
28,001028
29,001108
