stop_order,stop_id
1,E8A145669A392955
2,060A70079F196C7C
3,1F934873940D1F49
4,C9E264A3F9D4CEB3
5,558D298696B57A4D
6,364529AB163D8609
7,9217F5E1950F12BF
8,F1934936E2AB96E4
9,AEF88DA61C0553EE
10,D198122830A4FDE3
11,99EF4CA10B3E1F17
12,9FD865B00B2D54A1
13,64CE8117895E8FAD
14,29740CCBBD82FC33
15,AC5FA3C58493A4ED
16,057B2DCE8BE58FFA
17,4A91A327C9FC745E
18,2FFC93C766E566B5
19,F5A61D37E2DDA9D8
20,31079A9B244C679B
21,ABC15E2110BF7A49
22,932D83E09BF6ADE6
23,3366C1DC458401B3
24,4D30DF225016CBB0
25,12B9E30ED892A35A
26,D13C7436B13B4A4B
27,EC9467FAB4EC7203
28,4E279C21A109E9E3
29,F282012BBB2865E5
30,B550EC84B77440F8
31,20FDDA894D722F88
32,4E7C1C7F6D191BCB
33,815BC43527FD9247
34,B3F2EC8E42FA3184
35,2307DECBF51E9D7F
36,07142A6203E50A47
37,E92E009DE3307F85
38,E51AC47DDDA21250
