stop_order,stop_id
1,FD27DF93530C7540
2,BFCFEBF6F5C35402
3,F8B3A5C8D0D3CED7
4,3D5F826FD00C0529
5,876CF2E8C375F78B
6,6386333EDAC64C96
7,7B93AB79165E79E6
8,B802C4681F58E3E2
9,F8DED1E04A074504
10,8BE58FAD7E9C94C7
11,1DBADE3376C4149E
12,61130BDD0AFFBA86
13,147195048B687121
14,210978D525EEDF4F
15,C70342BF7C6A4732
16,0D5759F7A4B185FE
17,AAC64BCDD5B55A86
18,C552CE565E1F0C85
19,D3B54388E91DAB57
20,21466046C6868AA7
