stop_order,stop_id
1,886559B17A8D61EC
2,A911ACA189669DB4
3,A088D19226D59E98
4,C67060F448591E4F
5,14BDB94A8F3ED3EC
6,FA7A3D77713061E9
7,C7120BD9A94B4F6A
8,825199DC3BC0C5A3
9,ADB9356BBF06F7C7
10,8E3F5AE0A97053F9
11,68C7CBB4CAB9FE69
12,9CD9BFAE2BC91336
13,1BA6858FEF337645
14,4E655B25ABAE103A
15,18785E68EAD3D9B8
