stop_order,stop_id
1,001603
2,001777
3,001692
4,001595
5,001424
6,001585
7,001554
8,001555
9,001425
10,001427
11,001428
12,003303
13,001430
14,001431
15,001432
16,001433
17,001517
18,002033
19,002006
20,002007
21,001853
22,001856
23,001855
24,001864
25,001839
26,001863
27,001830
28,001844
29,002657
30,001832
31,001833
32,001834
33,001836
34,002671
