stop_order,stop_id
1,002341
2,002342
3,002259
4,002157
5,002158
6,002159
7,002343
8,002344
9,002383
10,002345
11,002347
12,002467
13,002436
14,002438
15,001213
16,001259
17,001260
18,001261
19,001262
20,001310
21,001249
