stop_order,stop_id
1,498836D151ECC5ED
2,455C67DEE3D3E649
3,3B05BCDB33F79D39
4,D073FFE1CF019F1F
5,569100345CF1E324
6,B603EBE7441D0A64
7,47A2AA98F8E20AE2
8,CAC48CE541F0E887
9,A63B90588F747496
10,A0C1BB5A1A985802
11,DC5AC2E3C1153288
12,7397A6CBBD749279
13,AF049AE41CC182FC
14,DEBD2B9A856C0B1F
15,F8A31970F2A8E25C
16,F1DE119543E382D9
17,44EA73AE2E27AC12
18,B4F2BAAED2470D0A
19,75C0DF6C7724CEEA
20,EBF4EB34B96BC242
21,3FE93821145B65F5
22,264B29FD223D9C4E
23,86D7BB9BA055D8A6
24,C24776F20FE877FF
25,257A6E19DD7F156C
26,28A57C043C111604
27,9EAD90CEBB1036D7
