stop_order,stop_id
1,657899B3C4E4F4A5
2,681212A971005D69
3,1472CA699A47EE46
4,B7082198F517B1E8
5,F36DEB05146E271D
6,015AD27DAC83E698
7,7380707A36C032B9
8,52AE04E9C3E77BE1
9,CC811B604DD883AE
10,8570495BD7C63C02
11,0A87C29A2B460C96
12,ED5554C57CF0061C
13,4D9419874306D82F
14,D625B0997C3DBCFE
15,E9468D2AE13C3F39
16,3B8776600A4384D1
17,D7EDDEA5A942843B
18,2F3C9727D9186DAB
19,8023E1026EA356F7
20,8C44D48B9BAAB774
21,300D1812E3A085C3
22,3DE979ACCBF8988B
23,5CA7841E84D52C8A
24,22138E6C8051FDBD
25,405DE12B9200AD9F
26,145515B1D2C60CAF
27,173B9ED2BF5D995C
