stop_order,stop_id
1,BA72214DFE48AA86
2,6E42FB38EBBE1C42
3,118212ABD14E1580
4,EEF73B5695D2AB0F
5,0AA7219BB2418438
6,844648D1EDB4A4CD
7,3DD89EF20A237A4C
8,8FA84681B967B3E2
9,5EDA0C1BE5CE95CF
10,424003F7939E9F01
11,4EFF1135BD93EE9E
12,F88D7720B4F389B0
13,FA141FB0FF048F32
14,FBE33E1EA7BA6051
15,DCDF76EA791EDED7
16,6E2A182F0DD98D48
17,51E6C8BD0176D660
18,E757600B79B0B2AC
19,412DEEF534E127AF
20,C552CE565E1F0C85
21,9C9F817064169CE7
22,61C957321A4DE4A9
23,E48E4C46F64FFB0E
24,21466046C6868AA7
