stop_order,stop_id
1,0D8135B0D81F29A1
2,5309D748976029CB
3,3C6DAB7267F9E54F
4,ADE2159E78D37819
5,2E2AD8BFE00F9FAB
6,F85916921D80C45A
7,1472CA699A47EE46
8,B7082198F517B1E8
9,93084A14AE624C6F
10,D17050E8964504BB
11,04DDF4F7F1C74876
12,1743738D38C82831
13,3ABDE54448D1E059
14,0511A6AC2CBC9A21
15,2CFCDB6EA2892637
16,616FE33CD20DB62E
17,CEFFBCE5203D152B
18,8571BCC3A3E4006E
19,D9896F1A5B7C97C0
20,3BA9C90738A8600D
21,54733D2BB5BE7121
22,9241EFF6313B41E8
