stop_order,stop_id
1,001382
2,001384
3,001366
4,001312
5,001226
6,001344
7,001309
8,001306
9,001307
10,001206
11,001201
12,001203
13,001202
14,001204
15,001300
16,001301
17,001302
18,001303
19,001304
20,001288
21,001271
22,001272
23,001273
24,001274
25,001275
26,001276
27,001277
28,001279
29,001281
30,001282
31,001245
32,001246
33,001368
34,001239
35,001240
36,001241
37,001242
38,001211
39,001250
40,001332
41,001310
42,001249
