stop_order,stop_id
1,88F78BDD9BDD7636
2,3DD784D9B2C30AFC
3,9B664F8FD4E76E48
4,5FD70A34C55CE590
5,A6DCDE5BE439B179
6,38C7D227DA221E77
7,1FBE6A92A88835D3
8,CF2B9E9382183398
9,C5C940CF1281B923
10,5941DC3E9FA7BE8B
11,ACCABC765E3F0961
12,CAF9395414DBD090
13,06C9926B2E2B304F
14,76B4054F2E1F00B0
15,17B98BD1165A7B92
