stop_order,stop_id
1,A412A5FD403C8275
2,3F21ED54F86D9B1D
3,7EC5C567E35D2805
4,739A5DDE0CF1970C
5,9E95343C77BB85E2
6,F808AF482CCA028E
7,DADEC4FDAD7C58B3
8,E8F5E085BAEFE100
9,79FD1B44D37205B8
10,369A5601F8A63B5E
11,A339426A8F633D63
12,CDB292D507E4302D
13,C55F50E43F6108EB
14,2AEDE966C122B71E
15,6716018C3EE42733
16,27222F0DE22582ED
17,9316961F98692D0A
18,67FC11E66080F9C2
19,378DA3C43904CFF9
20,9FBD2D7974A0AB50
21,1A0BF02F827F6A20
22,18E4449F4C5CE30B
23,9FD5C5940A1D7212
