stop_order,stop_id
1,7605CC9BA97A5F61
2,1B710D8F35AF94E7
3,76D5C1E2B23E8743
4,587ACF2E1135D8B6
5,E3B464760B6ADF30
6,ADA4B4F4B604885B
7,2CAFD3D60CAA7F5B
8,B577AC1835FA7995
9,2F4939964761E1FF
10,1030A4E612B75901
11,6AB438AD3AE100DD
12,456320D47FFB5B1A
13,36AABE317D2F7A0B
14,5EEA801CA265E5C1
15,5241470E37FA628F
16,CD7C28BDF71C00D7
17,1DEB855D55528B03
18,11A1269F9B78F269
19,E507F6160447C129
20,DCFF4041D0C0ACF8
