stop_order,stop_id
1,31418DC3F19236BF
2,B8BAF95E90D6E16E
3,3250A722B6084CC8
4,80818BFC3FE76A5B
5,2BDF4BB3B2E038A2
6,D9B82EE66AFF2975
7,ADD19B88AA8E99DC
8,F87A56BD0A2640ED
9,D54B0CA58FE5559D
10,3D566753F149907F
11,9FB710B737A32C3A
12,39CA64EA95DEE080
13,36DC37F6A54BA5E0
14,F5FA7ED5D5A6860D
15,D05C7D74301D47C5
16,41C9D989B8B874FF
17,FD27DF93530C7540
