stop_order,stop_id
1,D27B34CA3854232D
2,DCE0DAF77EBA1E21
3,3AD4DADA5B941CF2
4,CA9E9870D7B2FF36
5,D0FB28B8EED62431
6,C7120BD9A94B4F6A
7,825199DC3BC0C5A3
8,ADB9356BBF06F7C7
9,8E3F5AE0A97053F9
10,FF50570BA54BCA0B
11,4E655B25ABAE103A
12,AD4E0E8DC8ACEFB6
13,D5CD3F80BD65B1A9
14,A67D189D438E1534
15,B986375ED4762DA9
16,A7C1A969F48B62C0
17,D3E18D04B69DF388
18,C4F843F93CDCBE64
19,4235BA400EB10F0E
20,879A98CD29D9433F
21,0132863D9F66CE6B
