stop_order,stop_id
1,001027
2,001028
3,001044
4,001046
5,001049
6,001051
7,001052
8,001136
9,002427
10,002451
11,002538
12,002540
13,002470
14,002348
15,002355
16,002356
17,002357
18,002358
19,002213
20,002210
21,002211
22,002167
23,002168
24,002169
25,002364
