stop_order,stop_id
1,001249
2,001281
3,001282
4,001283
5,001286
6,001333
7,001334
8,002454
9,002414
10,002415
11,002416
12,002418
13,002420
14,001033
15,001034
16,001036
17,001037
18,001193
19,001628
20,001853
21,002714
22,003550
23,001837
