stop_order,stop_id
1,29E5BCA5DC430F85
2,EDFC39232C98E301
3,449F6831A832F1F3
4,3E54E8AF4083B065
5,29ED2073D6C52B5A
6,F90ED764C7A95649
7,D46ED62A04D37ECE
8,68A8F08ABC5C90F0
9,91929D42214F3D7F
10,AB51CD6EFEF7E09E
11,DF4F6B54816F5172
12,558599642E78BB9B
13,BEEBDDB542A7E709
14,48184733EFE9D3E3
15,8E8DB91C885F1230
16,DCFF4041D0C0ACF8
