stop_order,stop_id
1,6DD025C559ABD59D
2,FBBF4EB577663A13
3,F97A667725CDEB82
4,73FE2D32F218DA9C
5,A264255E81F51111
6,4C86E1F44AE9C25B
7,79C0E2525F4B50FF
8,324EF7E116289941
9,D2425B7147B58E1D
10,A4607B71730E8F46
11,3ECEF3B735084236
12,447C1D79A10C83E2
13,6C1C752975B8A257
14,783CE18C333C6069
15,C0AA7F3501EFA657
16,25B94D808EC232D8
17,2F165341B07CBDB9
18,FD1B403FD4EC3E8D
19,DE620CFFEE15A211
