stop_order,stop_id
1,002299
2,002294
3,002363
4,002158
5,002162
6,002163
7,002261
8,002226
9,002183
10,002184
11,002185
12,002187
13,002227
14,002228
15,002229
16,002230
17,002231
18,002232
19,001109
20,001110
21,001111
22,001112
23,001113
24,001628
25,002862
26,001483
27,001546
28,001547
29,001548
30,001552
31,001554
32,001555
33,001426
34,001429
35,002810
36,001687
37,002885
38,003604
39,003600
