stop_order,stop_id
1,001196
2,001176
3,001137
4,001053
5,001055
6,001057
7,001058
8,001628
9,003672
10,003673
11,003674
12,003675
13,003676
14,003677
15,003678
16,003679
17,003680
18,003681
19,003682
20,003660
