stop_order,stop_id
1,B11CEE32F54245CE
2,F139E189918C1F86
3,52B02EAC7AAB23C1
4,B9EE83CA8ABB578B
5,6CDAC4513AD44DB7
6,72936E1AD7A19462
7,30D564180B68ECA8
8,EDDE9311F49AC296
9,D9B53E4B3A192940
10,BC7C325EE59235E4
11,9E256D7EE9FE68BC
12,DF942A6B97EABDC4
13,2DDD1CB69E981669
14,80B56E2C7719DAF4
15,71E3EB7E709522C7
16,8D0555A78A132018
17,2D3C0F18F9131DA2
