stop_order,stop_id
1,B545DBB9B5AA7A78
2,9CAF2FDA35EEF9E2
3,4A38244491180BF7
4,5419928D472EAD8D
5,357B7D41501CDACA
6,D7C7D86E923EEAE1
7,A76BB6FCB881AF5C
8,0F4F935A9F14F111
9,136480342AAF0BD2
10,32CCEDBCC9EAAA9E
11,2751781A6F757C5D
12,6045969736940272
13,38A53BACD13CD0C8
14,0CB1F7979192FBB2
15,2C5CA5F47FB6EB3F
16,10E07C1870465E91
