stop_order,stop_id
1,001207
2,002782
3,001301
4,001356
5,001357
6,003781
7,001358
8,001359
9,001360
10,001361
11,001375
12,001313
13,001293
14,001315
15,001304
16,001288
17,001271
18,001272
19,001273
20,001274
21,001275
22,001276
23,001277
24,001279
25,001281
26,001282
27,001286
28,001215
29,002439
30,002404
31,002470
32,002348
33,002355
34,002357
35,002358
36,002160
37,002161
38,002162
39,002298
40,002299
