stop_order,stop_id
1,550A2C52049679A0
2,F893C6ABC2743F64
3,B27236FC63F891D9
4,96A6FE5F07BDF203
5,48D7576D3F243169
6,7BE7C25016F9651E
7,7BFC2AE979358DA7
8,03A546A0953794FA
9,52C1ADA57FFA7DD4
10,24E16716BBB7F2D0
11,F4ABF71262D8C556
12,896D3C4F7F91E9C9
13,C6F406D78E5C515A
14,8ECFB7DFFC0023DA
15,33A4BFE372C06BA8
16,B8BBCCA288E1F862
17,A930EDA042B0F47A
18,36D7B643B6B5680A
