stop_order,stop_id
1,FA5C305D16B299A5
2,3C0AF6BA82588E2F
3,F8DEE1D5F9A349AD
4,4A14A012710E80B1
5,F4D6C8BE3A3DADDD
6,1C111CE3CE325C6A
7,A971B9FF20627145
8,28A55D04DC72B1EA
9,41E81A921D79F375
10,04B6438688E12AC0
11,6CEE063506576EDB
12,B5CB3F0D26BBBD03
13,E121F366E450943D
14,5AAC6A858427D04E
15,5BDD5F9F4C89D3E1
16,E0558D2901ECC032
17,458A5CD02E6008EC
18,D2F2B3C5436007C2
19,EC2573EE5FF42AAC
20,74EE2ECB1A3773E9
21,B4962A215D3DFA65
