stop_order,stop_id
1,0BA94B06D53CEB12
2,0B8C52E4C34E3B64
3,2A5B424322D35B0A
4,ED8812E232F6958A
5,13A8D09F9E444BF3
6,DA29C9192B8D12DC
7,1383B6EF75A7AA6D
8,6491C7B3E4DAD76D
9,1107CC28F2631CCB
10,3EF537320681EE89
11,2EF9764BE18FC290
12,5B04604E989BBDF0
13,70F41B968EA8E456
14,45C2286729E1475B
15,8B8DDE8FC3A125B8
