stop_order,stop_id
1,430B9D9C6AFF364D
2,FE2815CBCD21C57C
3,F2508598F5A43655
4,3313287185163530
5,89D32777124F4039
6,AB057A63C24E990E
7,8000ABB2A7252841
8,68106C827BF891AB
9,EA4A3876639F21B4
10,1B9CA570385CC6F2
11,6C34AE386C779E0B
12,EBB057754E3423CE
13,3C9C928E1674AB98
14,038F62C619BF8650
15,A8E63F70F386C05A
16,E173F2DA030C6AAB
17,6E2A7A2CD29F9216
18,610F9B32EEAE091D
19,99256D08CF861BA5
20,D0A763AFCDE36124
21,0BE28656FCEAAE17
22,CCAC1239A80FFE6B
23,317CDFC0C1DB2ADF
24,9508A6CF0AF1E1B2
25,B8B71BC8E2DDCA8D
26,62AB7611613EF561
27,D355B700FF30B3D7
28,1B68DD9D137F906D
29,3856383C8A22904A
30,E35B5F1B80E085E6
31,A3F6D2CA9135A988
32,375D37F2AF5D762A
33,37A4D07D7179CE76
34,C979915CB2F4A35C
35,94612276CB142F93
36,24BB2F5E5721E970
37,0E7645CCF6AA3558
38,422BD13B241CCD5B
39,AD326AC36444B948
40,6E6EBC9D1AF2DA52
41,F273E57C36913893
42,D52D3F3FB66EF61A
43,6DF1AF2871D4B7D9
44,196A1E44C305C174
45,BDE0F1679E1C8ABF
46,13458794A52910B0
47,67DFAB691BECE339
48,6D016EBFA090D535
49,04D3244DD2B38746
50,59B81980AC8F7878
51,4236C502F947A6DF
52,C78F66DF6FA871B6
53,8D7CB6C3D48258D6
54,5D919BA157405E33
55,A2BE47AFF20CD4F6
56,CC6B75E6D60B4C57
57,26AC2D471648CA0C
