stop_order,stop_id
1,F80DF64ABE690251
2,3CCF4F6EA48CF505
3,7AECAF57AF679EE7
4,116624D40FDE852C
5,DA8B258D68133BDD
6,75DEBB78067301B8
7,D4CE0ED4DF009B66
8,B714B480F96C22D5
9,531B557CFBFFD232
10,46261DE8D4DFD821
11,5A3DB1CED74A109E
12,22E22257A0FA43D3
13,752B1B808E1B4CB5
14,E346E933481C3D83
