stop_order,stop_id
1,A0E2F1B6E155C92F
2,68DE9CB8E6AE046C
3,D6E7412666B1175B
4,AB87BD2749FFEACA
5,43398296F1D1BD48
6,65D1B50CC2E45985
7,67F3E54FF145BA65
8,F93448A5F1168FB1
9,DFB7FD5832A4BA4E
10,0F60AAE48C3B22EE
11,0CFB814CB6C356C1
12,196A1E44C305C174
13,BDE0F1679E1C8ABF
14,13458794A52910B0
15,67DFAB691BECE339
16,6D016EBFA090D535
17,04D3244DD2B38746
18,59B81980AC8F7878
19,143D7489C808BD46
20,F4FC91D18962C4D0
21,624D05A1E7A5A045
22,E45E7DB1786B6324
