stop_order,stop_id
1,26A1D2969A15C3AF
2,4E655B25ABAE103A
3,AD4E0E8DC8ACEFB6
4,DF8F6AA868615D47
5,FFFB0F940CA7BEA7
6,1D202282C0A82F12
7,D813C93D9AD1C45B
8,7BB395B6FE66E102
9,6D4E7B9D5F9584E7
10,47AB1894215AECEE
11,42AEF6365E78DA56
12,8753A8442C2FFF53
13,8D56DB404D264D5A
14,430C6E88A93B42DE
