stop_order,stop_id
1,002723
2,002724
3,002725
4,002726
5,002727
6,002728
7,001616
8,002729
9,002730
10,001395
11,001554
12,001555
13,001425
14,001427
15,001428
16,003303
17,001430
18,001431
19,001432
20,001433
21,001517
22,002033
23,001853
24,001869
25,001857
26,003566
27,003567
28,003568
29,001874
30,002589
31,001870
