stop_order,stop_id
1,B992A98ADB59C13A
2,153D32217234A0F0
3,F2508598F5A43655
4,3313287185163530
5,89D32777124F4039
6,AB057A63C24E990E
7,8000ABB2A7252841
8,EA4A3876639F21B4
9,B0F64FFFBECE8AA4
10,3B672FFFDB172686
11,E173F2DA030C6AAB
12,0F4F935A9F14F111
13,D7C46496C9C7B7BA
