stop_order,stop_id
1,296E43213D6DB624
2,32CB1FBDCB7932A6
3,CCAD6B9A4B1CFFD8
4,1BD82E4312536F0C
5,5FBC215F6F58AC98
6,A411F9374FB2879B
7,5A0D9C9441ED6AC5
8,9BF9C994F2DAE15D
9,F5098BFD784B8FAB
10,1C7C526A52EF9171
11,DED3339EB26494EA
12,577633405E7A3ACD
13,F6EE4DC41A299593
14,83EB94899B6BBB4B
15,5F60283656DF3016
16,576538E1395C8508
17,1864222D8939BD69
18,95FAB1D2AD752ECE
19,505D36136FD57784
