stop_order,stop_id
1,64D3081966987039
2,D2B43459063F53DB
3,7995F69FE44D0DB3
4,F90ED764C7A95649
5,558599642E78BB9B
6,BEEBDDB542A7E709
7,48184733EFE9D3E3
8,1F2E60EDB4254D30
9,D066F149BE3A1D28
10,1B9CA570385CC6F2
11,E5E7111594073DE2
12,B0668BFF6178BA0B
13,AA97FFC49AE957A5
14,416B7606A9A5FEEB
15,D4707218581C0F72
16,B68FB7076BB07A22
17,553D370FA21F7DA4
18,72999453ECAC4693
19,64D3081966987039
