stop_order,stop_id
1,EC19750840FFEDDC
2,B76B249D3D253008
3,A7F35DC09E1A1528
4,D242B538BA760551
5,11ED493F674F4888
6,BA765A2BCCE21F5C
7,BE510511B0A7344E
8,BE1A19A3705F5B70
9,95731C2B3563CF5E
10,4AFCFC726ADBD5F7
11,DD9DF46F3BA040EE
12,B7C0A83790F94D99
13,06566A7FE3C6466A
14,7DD772B7D55C54B2
15,62742CFBA2BE9854
16,E55FA660A59AB64A
17,E481F7170B1F6FC3
18,14157BA5C06B0B6B
19,F63C4B8B958E9830
20,74C51A8A3D783F40
21,0E2B8E1D544C6889
22,A010FE2C473103A8
23,70FEB409760C77EE
24,A1A1B10F5CE291AC
25,A2C36DF7152EE93F
26,60A4F4A41CD61FAC
27,8F6C8CEB9F17D97D
28,B09E18636F184247
29,5FCE752FBBAB3B14
30,8FA8E142E834CB7C
31,D86A74227012EAD3
32,FFF1B4F48E111EAD
33,87BCEC3D8C6951B2
34,6D66CBA494DECB08
