stop_order,stop_id
1,BA6D9F93E62B8075
2,1D6A8B8C58C268FF
3,95C538941C437656
4,5A77AE8E12B13718
5,4A3D71FFAB41B756
6,A78292AA77A277A7
7,9E03B65B407F925A
8,A295FD27A4E5A7C5
9,C43782B93826F4CD
10,2223D64E9ED2E1A7
11,3114213F8975F536
12,D1AAD1771F3FA9A0
13,C80FB453C9F53569
14,2A01E3163DF9A954
15,F6E296480D3481A2
16,25455FDE268CF605
17,C1AFF00AC64F457A
18,5396072459507B7F
19,C048D4CF6ED36C7A
20,68A8F08ABC5C90F0
21,91929D42214F3D7F
22,97B7EC0354E020B7
23,ED03E689B88CE0E8
24,B122FA4A77BABF24
25,B452F1514B4FEE40
