stop_order,stop_id
1,973EBE6A3543C701
2,AB87BD2749FFEACA
3,D0BE5E470FE2AD0B
4,67F3E54FF145BA65
5,F02CE37AD01DF17E
6,3A9EE9221AB3E27C
7,7192051038B36F08
8,1A37A52F97A04C81
9,CA60760D2303E6D0
10,466111DE1A3E4656
11,CE1BEC7176C47D52
12,C93D9BCDD63A360F
13,ECA27B00E599556A
14,D0C67A916767F79B
15,04601C2FB7201CAA
16,E74202351AF7F37D
17,85D7313CCE53D396
18,36904A9AD2C13B32
19,1F3870BB293E9DAF
20,DB3C788ACBB6668D
21,DF901EF2F9A46F7B
22,6F206EE9D2AF0838
