stop_order,stop_id
1,001185
2,001027
3,001044
4,001049
5,001030
6,001031
7,001136
8,002967
9,003337
10,002422
11,002423
12,001316
13,002559
14,001379
15,001378
16,002792
17,001296
18,001297
19,001298
20,001380
21,001207
22,001390
23,003157
24,003155
