stop_order,stop_id
1,003345
2,003346
3,003092
4,001950
5,001914
6,001915
7,003078
8,002028
9,002029
10,001986
11,001463
12,001278
13,001281
14,001283
15,001286
16,001215
17,002457
18,002567
19,002442
20,002444
21,002445
22,002459
23,001074
24,001138
