stop_order,stop_id
1,DF246F9F07691C22
2,2129B2A72F881300
3,4CA5DEBCC576E371
4,F4176942E449DF32
5,39AE60AD7BADCDAA
6,A4837AB15400D744
7,37E653F1DC727EB2
8,CB295B56D3762A1F
9,F8B3E5A11921AD1B
10,C66CDE62B5AEB8DA
11,832EFD8F5165814E
12,F7670D87C1847D31
13,BE5E07865E13374E
14,94236C65C84D8C17
15,4C82D99D0721ADE9
16,8C1810DE2419A30B
17,56F79FB1FC157E22
18,6DE63371E5E799BA
19,3CE4F8574F4F9D72
20,3FD481FB9B9DC36C
21,FB5500F0D32629B2
22,55D37B4406A049FB
23,BBFADA4889A61FCC
24,43531EDD45A4B0C1
