stop_order,stop_id
1,6098480103C44C62
2,F8D1049558163BE6
3,7703B0499F66B205
4,457C64EC8955C896
5,4A0370F0CA6A89B2
6,3D47C2B2D3342C85
7,CB59198C6E7D00FF
8,F3DA32A55B98363F
9,BC3B37FDEE7EE51B
10,5CE1C1296F98C6C4
11,E24537CF3879CD25
12,C0ACDED85452CFC8
13,6E9A9467758898B7
14,2A9C98A6B36F3B11
15,7F3A1FC5F4533B4C
16,ED244F7BBACAB14D
17,8C44D48B9BAAB774
18,300D1812E3A085C3
19,1EC9ED318297A470
20,610F9B32EEAE091D
21,3CE4A2049409A6DD
22,E6ED785726AED4AE
23,09889186EAB604F2
24,BA2F4E8CB1D43CD8
25,55973ABF49182097
26,0E718C4DB85C8005
27,0CC9C5E5DBB3FF89
28,F39F638D34947E40
29,F9F4E00007242BED
30,4E870B220826BEE0
31,5AD2A4D21C226335
32,A454170B2B59B587
33,D6E7412666B1175B
34,AB87BD2749FFEACA
35,43398296F1D1BD48
36,65D1B50CC2E45985
37,67F3E54FF145BA65
38,F93448A5F1168FB1
39,DFB7FD5832A4BA4E
40,196A1E44C305C174
41,D34C171F5A6DCDA9
