stop_order,stop_id
1,4937A56C05FABA08
2,FBE38593BDEB0802
3,9A0959AB68FA5E1F
4,91449853378E9F8F
5,A24F5416BCCE60F9
6,32A2D05A195364DC
7,BC932662BA367CD0
8,E207DBF95EA7DE26
9,D625B0997C3DBCFE
10,67727D444E2EC42B
11,3161D898CD89AA38
12,9DBBC71CB1578A87
13,312CD2A987AA2773
14,40E8A4AA35AEB18A
15,55EE74AF2D1A7DAA
16,6F5585807DB07812
17,D060669C0A3DD8D1
18,D01D18C6EB79F84B
19,A72D15160CC3AF31
20,8D5C58075D3C1003
21,B0DDF2CD704116C8
22,6C1DEF32B8CB92C4
23,161B32AD4C6996AD
24,6965D1D655C2DD5F
25,BB172B3A5DAC85A4
26,D7A05B5BAF07A89B
27,3D717F0365D5505B
28,29759ECB92E1A91B
29,B48B8F12CD929F0F
30,72999453ECAC4693
31,4937A56C05FABA08
