stop_order,stop_id
1,752B1B808E1B4CB5
2,3C3AFAA5179D7F6D
3,130015EE1C05A484
4,0F9DE5E3F13FBABA
5,FCE8D0E0D2A89B8B
6,D77779E531F14725
7,F626C47C1F73E1AE
8,813A44129E51981F
9,8972CD96C0B11BB2
10,4AA82FE086BA80FD
11,3410D9B6EF36D674
12,9D88EE061FF5E1D0
13,3F0C9DF601178557
14,2BD0ACE05ADB9AD1
15,459BE083B86A8337
16,CD4626E2F32FE372
17,BD830C5E8AAE1C74
18,EC49B6F5634BC0C2
19,7AC6625D894BA101
20,CBE54DB551C24A02
21,31005C82D70F6B09
22,F8C20FE9111D486A
23,CF94083CB24CF4E5
24,4A76CDB32FA69BC6
25,6F11F73C749338DB
26,98EBAB9468C80DD2
27,6DD6B837EF1FA76C
28,AFD29CB1A4F71AB9
29,65ECD19EFD09FB74
30,D67917549F3DC8A3
31,6633B4885C8A3EE7
32,0F3FA9B7D07A91F3
33,C837C3C549793472
34,C1210CE431B3BB88
