stop_order,stop_id
1,C35DF653E02636CD
2,6085C420AB7E6FF9
3,C91C122CFC3FF66B
4,DF10BE627F25E7DD
5,D7C7D86E923EEAE1
6,A76BB6FCB881AF5C
7,3B7368AAB82CC612
8,D7C46496C9C7B7BA
9,D0A763AFCDE36124
10,B63533CEFAA3269F
11,2D1C6EC793734CBA
12,4D0C5F20055CA652
13,BFD37036CFD5FCA1
14,24D77D8722934A82
15,A568A1F7953CDB7C
16,8967776AA0DF7E29
17,C12CB15E0CE109FF
18,4C0E31FF4D276D4D
19,5291C2473CB76D81
20,1E459B2BE44AF232
21,4E237FEC65B2FF28
22,E2733C6EFAF398B8
23,4C19E0623146E4F9
24,CCC5BAA6257BBDAA
25,D9111A160E3787AB
26,EEDFC5EC1DD36179
27,458D2C951A759CAD
28,9096776C02070F8E
