stop_order,stop_id
1,88F78BDD9BDD7636
2,3DD784D9B2C30AFC
3,939FE9A08B99174C
4,CAEEAD91F339D3DA
5,033CB7A21D6DC60C
6,72F743E4D464E498
7,28B264A688848238
8,709C8604AFB90F27
9,8379C4B1265C27F7
10,C804CCACB2781EEE
11,AD1B202B678A3B56
12,B30799FB3732222B
