stop_order,stop_id
1,001108
2,001035
3,001037
4,001039
5,001040
6,001134
7,001135
8,001130
9,001131
10,001119
11,001116
12,001117
13,001120
14,001118
15,002234
16,002236
17,002237
18,002238
19,002239
20,002240
21,002233
22,002260
23,003287
24,002157
25,002158
26,002159
27,002344
28,002224
29,002223
