stop_order,stop_id
1,65E5446D6E45180A
2,98EBAB9468C80DD2
3,6DD6B837EF1FA76C
4,AFD29CB1A4F71AB9
5,60952B4A38F3D82E
6,0E41E02CD9055626
7,EE81A30BE4BDC8AC
8,D4C4D9175A19C230
9,2129B2A72F881300
10,FA52803E2628A212
11,E6022594DB48E35B
12,620E14F31DA31490
13,09B4297CB90AF3EC
14,97BB9CE7A058E809
15,9FD6AAFA1318E3D9
16,03A5552B84E8214B
17,0B4807A5C0DAF24A
18,40A8EA2850B0979B
19,B943DBEE65B0B18F
20,7019D5AE9C63EE72
21,01642BC44DCFDB3C
22,AA1572E26F6BCA34
