stop_order,stop_id
1,715C1540F21003D5
2,62F395D60229C8F5
3,1FBAAE29AF1CA50E
4,03C3F537C41E4986
5,2FFC93C766E566B5
6,F5A61D37E2DDA9D8
7,31079A9B244C679B
8,ABC15E2110BF7A49
9,BC66863007C0592B
10,848CA90EB0DB1146
11,7486D53F341F1AAC
12,FC42DCBDC3AB0B6F
13,22E2678081E88368
14,7613538D58A9C452
15,336FF66D1F0AC4A0
16,D732B7AE560F7326
17,75E1777F474658CA
