stop_order,stop_id
1,EC038424C17E0B60
2,51E196E962453AB4
3,264B29FD223D9C4E
4,86D7BB9BA055D8A6
5,BF6A2F247B90FEBB
6,1423FCFF61709EAC
7,B09E06FF6EF5A8C4
8,508B02C5E209E802
9,6C11A9780213BBBB
10,2AC908C8F703349B
