stop_order,stop_id
1,86218AD69549D7B2
2,558ED5EDA9A0C43C
3,7D72DDC29E02C14D
4,D926EC9FC8BCE6BD
5,F15B04D268DD5C8F
6,C22372B9DAD0859C
7,CFCF195771D9D63E
8,9B68464F2596E2FE
9,04A05525A6AB819D
10,D1F2F468672FB541
11,BA2B81A1A81DB398
12,D44F9DCC71251889
