stop_order,stop_id
1,4A38244491180BF7
2,5419928D472EAD8D
3,36DD78B37B828DD8
4,D7C7D86E923EEAE1
5,A76BB6FCB881AF5C
6,0F4F935A9F14F111
7,7ADC6D521E6BECE6
8,E02E10C9135624F9
9,3B8B261C1DA409BD
10,9DA7325E4238402B
11,195C509959C6A799
12,3F21ED54F86D9B1D
13,BF72FF473A660C0E
14,ABFB3F43ECB908B2
15,C1E9F8237EDBBAD2
16,7F068ADB0659F04E
17,779954C17EAF3B95
18,CB0585244877B9B9
19,69E4C417312C10C0
20,C1E1199805BCC92D
21,EAA44CDBC231DB8C
