stop_order,stop_id
1,B37FC6600B2254B6
2,060A70079F196C7C
3,1F934873940D1F49
4,C9E264A3F9D4CEB3
5,558D298696B57A4D
6,364529AB163D8609
7,9217F5E1950F12BF
8,F1934936E2AB96E4
9,AEF88DA61C0553EE
10,D198122830A4FDE3
11,99EF4CA10B3E1F17
12,C847B9021C407731
13,9FD865B00B2D54A1
14,64CE8117895E8FAD
15,29740CCBBD82FC33
16,EB666DF59D741258
17,A0AB9A2B2D648FF5
18,484F835517494767
19,E308599CF719FE37
20,4A14A012710E80B1
21,25D24692B2A312FB
22,6F106FD26B684372
23,D83C4CC1305E35E9
24,466BC4C1908A1A06
25,2FFC93C766E566B5
26,F5A61D37E2DDA9D8
27,31079A9B244C679B
28,ABC15E2110BF7A49
29,932D83E09BF6ADE6
30,3366C1DC458401B3
31,B64E0F355A9F4223
32,FC42DCBDC3AB0B6F
33,22E2678081E88368
34,7613538D58A9C452
35,336FF66D1F0AC4A0
36,54FCA9F5D8F3587E
37,711927A9FAEF1158
38,F09FF6C6349030C6
39,D13C7436B13B4A4B
40,EC9467FAB4EC7203
41,4E279C21A109E9E3
42,F282012BBB2865E5
43,B550EC84B77440F8
44,20FDDA894D722F88
45,4E7C1C7F6D191BCB
46,815BC43527FD9247
47,B3F2EC8E42FA3184
48,2307DECBF51E9D7F
49,07142A6203E50A47
50,E92E009DE3307F85
51,E51AC47DDDA21250
