stop_order,stop_id
1,173B9ED2BF5D995C
2,51288CE4C842111E
3,B76B249D3D253008
4,A7F35DC09E1A1528
5,0F4DB224F8A8FF9C
6,80E2DB8AC142F626
7,E93113C9CA615B0C
8,D48E82AC2961C581
9,B0668BFF6178BA0B
10,3CB94742E4B5E3E5
11,33033960343A57A8
12,416B7606A9A5FEEB
13,C4AF473A49643363
14,921C19F6147C74A6
15,47C3597662B81B47
16,7EF64469471FE344
17,0A03521DFD20FEA9
18,6882248B39345F28
19,B809C24DC8C87767
20,3BA4DBB4520188DF
21,03C3F537C41E4986
22,2FFC93C766E566B5
23,F5A61D37E2DDA9D8
24,31079A9B244C679B
25,ABC15E2110BF7A49
26,932D83E09BF6ADE6
27,848CA90EB0DB1146
28,7486D53F341F1AAC
29,C73A03D6C468B767
30,4AF1A7C103D16636
31,C8DFFC6DB50F5F86
