stop_order,stop_id
1,002186
2,002190
3,002328
4,002339
5,002341
6,002342
7,002260
8,002259
9,002363
10,002159
11,002343
12,002344
13,002383
14,002345
15,002347
16,002467
17,002436
18,002438
19,001213
20,001259
21,001260
22,001261
23,001262
24,001310
25,001249
