stop_order,stop_id
1,B8BAF95E90D6E16E
2,3250A722B6084CC8
3,80818BFC3FE76A5B
4,D9B82EE66AFF2975
5,ADD19B88AA8E99DC
6,F87A56BD0A2640ED
7,D54B0CA58FE5559D
8,3D566753F149907F
9,9FB710B737A32C3A
10,39CA64EA95DEE080
11,36DC37F6A54BA5E0
12,F5FA7ED5D5A6860D
13,D05C7D74301D47C5
14,41C9D989B8B874FF
15,FD27DF93530C7540
