stop_order,stop_id
1,96B1EEEF3B7B29A0
2,496BF5ECB5F376CB
3,A07D2012213FC19D
4,9E87D9D0191DACE9
5,8019E4CBB686CD25
6,ECE98AAA81373891
7,BF4622C022F17E9D
8,F508350699744D24
9,34740DD5ABC36F12
10,25E1BAE2C272ED4C
11,E34E3D48842C9B66
12,DF9E89A391CAC245
13,657E5836BC932790
14,7A1C43F91CF8A6FC
15,98FCC750B322B706
16,BC294083A50B89DB
17,38CBB6C76211934F
18,F63C76EC97E38A91
19,777ED0B1F3CF10DD
20,96442B84082D4DF5
21,508D99EBC9AB3A9B
22,FE56DD70DEDE0395
23,D2217D7746597D10
24,576538E1395C8508
25,68DF2B78CD2B9C76
