stop_order,stop_id
1,437924EA663F3DF6
2,89240EC55B8818BC
3,259B42E9BB57199D
4,E39225003155E094
5,919C2FE90FDCAD6A
6,EE212E6FD5124813
7,3945D5C71A298168
8,B4E25ABB1C5DE439
9,4A0ECA0D5AA4CB7E
10,437CE05BCFE6248C
11,A3D85C5591D7F0CA
12,241AA85186E2C93E
13,2412E319B88EBF96
14,907CF3142C0E02BB
15,A5FDDA13C2C7A953
16,EE1D20D5B82B3370
17,412DEEF534E127AF
18,AAC64BCDD5B55A86
19,C552CE565E1F0C85
20,21466046C6868AA7
