stop_order,stop_id
1,AC7BAEAFD509A843
2,544108A588F637C1
3,192B61150EE2B065
4,249DF4A1B287E14F
5,AF9FE138E3D5D5F0
6,1D44677AEFBA8773
7,18580F35B0A312CF
8,D0236013EDCA9EB1
9,4242AE6B4D680E23
10,49713551E95C1DA1
11,1AADC7F6E13C1321
12,F734736F35F459DC
13,23B913EACE0581E4
14,C6D5DEF91CB7B581
15,5051A4FF380B1502
16,9E1FC92F86D2F4E3
17,FB46A4053B38C81D
18,BA72A994EEF9FABE
19,F8FE29B1FAF8BA77
20,B26245505565A1E0
21,3D2F9154CBD9A387
22,7E63082F897024A3
23,2D1C73EF002336DC
24,66C1F17901E91CD9
25,5B54D6F8B590E039
26,CC3EF4757AA0964A
27,E92E2723C1DBA061
28,A9C009CFA994A79C
