stop_order,stop_id
1,938667F4F953DFCA
2,1EF9F54185151A2F
3,4E62491AA640A5EB
4,3E8B459E94CD57E5
5,D0B1FC246C384949
6,3998A0C9E65D379B
7,B64E0F355A9F4223
8,9B90BAE383F14AD3
9,E86C2ACAFC72D243
10,68799FD9ECBF50B1
11,4A84482F3A54E4CC
12,5D034EAC6A8853A3
13,70A7D4C9EDA6D50A
14,EA2CFF27310EAEC3
15,25863CD2A364E72F
16,F36C1B3AC57D96FA
17,B1B0E08245C0FC15
18,2E2AD8BFE00F9FAB
19,3CB982FBC9E50AAA
20,F85916921D80C45A
21,1EF0671DB830C59D
22,B7082198F517B1E8
23,62F395D60229C8F5
24,1FBAAE29AF1CA50E
25,03C3F537C41E4986
26,2FFC93C766E566B5
27,F5A61D37E2DDA9D8
28,31079A9B244C679B
29,ABC15E2110BF7A49
30,932D83E09BF6ADE6
31,848CA90EB0DB1146
32,7486D53F341F1AAC
33,C73A03D6C468B767
34,4AF1A7C103D16636
