stop_order,stop_id
1,003456
2,003457
3,003582
4,003583
5,003345
6,003346
7,003083
8,003076
9,003077
10,001950
11,003093
12,001914
13,001915
14,001629
15,001258
16,001267
17,001268
18,001393
19,001270
20,001296
21,001297
22,001298
23,001299
24,001216
25,001217
26,001218
27,001219
28,001220
29,001221
30,001222
31,001224
32,002591
