stop_order,stop_id
1,9023D76FFC026362
2,0D005977F208D030
3,93933C15FFC9F4CC
4,65F591143DC7CF9C
5,3DA55A5A4970DBFE
6,0D98A0E934584FD0
7,F87A56BD0A2640ED
8,D8F0A3AD8E765CE0
9,6723518D536070AB
10,919524B8F36AF7F1
11,0CF8C59B80E70369
12,C480A2E59BC05FB0
13,71D916F7E97D18A3
14,42AEF6365E78DA56
15,8753A8442C2FFF53
16,8D56DB404D264D5A
17,63DF37D89C356A04
18,1A52AD7D8F64311F
