stop_order,stop_id
1,001757
2,003028
3,001702
4,001703
5,001704
6,001705
7,001699
8,003370
9,003537
10,001811
11,001813
12,001600
13,003578
14,001808
15,003579
16,001480
17,001481
18,001482
19,001586
20,001853
21,003550
22,002714
23,001837
