stop_order,stop_id
1,9C4295A3DD992F0E
2,8A8E1370026F639C
3,C904C536EC3E0827
4,1843FAE700FCA5AF
5,65523F89F26B2088
6,6D9F5C463D12461B
7,8BD7CEC6396E46F0
8,54F26831BD4A5EBD
9,65DA1259C72FD22B
10,7D77D56CB708BCED
11,2ECC1DBA0C28E93C
12,CAEFA7D6314535BC
13,D1601C6EDAB39F29
14,4A0CEB0807BAF9B3
15,3007D34FB91FB27E
16,1AB934EFE0E1470A
17,048A87496B30B946
18,A71457854D13E9DE
19,AC1E2BBDC663717F
20,A07CC0A6D462A579
21,9E25CF3DAA0BA0C4
22,9541036143D6CCF1
23,13C75FFFA2BB060D
24,D1D807234805DBF4
25,79AFB35F9DBD485A
26,6F755DD7C8AEB1B4
27,D5DB45916FCE114A
28,5D94D3084F0C3831
29,E907FA24426A9FD6
30,89A4D25AC31A8388
31,6465986EF7824816
32,F21DC659FA565E2F
33,E3EEF07674DE3B98
34,A96BE8855D16BCE0
35,F3753E60F86B0068
36,67C00FA00C878C1A
37,7A899F3009A31F68
38,EA4A37322CB0EBE8
39,CEACD1DF9F00EF44
40,6E410E80F8C9915B
41,2BF46D2A46F5451D
