stop_order,stop_id
1,001676
2,001677
3,001678
4,001679
5,001680
6,001681
7,001682
8,001700
9,001683
10,001760
11,001759
12,003589
13,002656
14,001491
15,001492
16,001463
17,001278
18,001281
19,001283
20,001286
21,001215
22,002457
23,002567
24,002442
25,002444
26,002446
27,001141
28,001142
29,001106
30,001285
31,002962
32,002563
33,002416
34,002418
35,002420
36,001074
37,001033
38,001032
