stop_order,stop_id
1,A3658E938F378588
2,2659CEA57836F600
3,00408DDF35401A43
4,1E15CFA82F408124
5,CD4626E2F32FE372
6,25E34120CA3AD554
7,6D9EB45795E40B40
8,02824AAFC038FA20
9,0FB4AEA370913FD2
10,0F35C99BABE4D40E
11,78B3C90A0D7DDDE3
12,E2AE7A37634C8FE5
13,B954B8082D1AA9B0
14,57E8A522E2C638FD
15,9170FC8FFFD12204
16,D2C1DACCC74B69C5
17,EBE1766B508217AF
18,C4F843F93CDCBE64
19,4235BA400EB10F0E
20,879A98CD29D9433F
21,A22E315AD21129EB
22,87F9F165B63331A5
23,C1210CE431B3BB88
