stop_order,stop_id
1,33D5CDFE9FBE56A1
2,3199543D3AE70527
3,2B354AE312900DF1
4,AA5DA45828958EAE
5,876057D899CE09C9
6,FA553D19AD960A9B
7,642F7D358D36F715
8,F269ACD809D1B43E
9,68354B780EDFC52B
10,665CE110A84542E9
11,F5A44B89EFBC0B4F
12,EA3C8544DF22AC4E
13,58100E7F618C4018
14,5D1E6432755E4F5F
15,D80313EC29620E1D
16,BA03816A38B9DA7F
17,D0F8772D043C207E
18,E5E15C5F7F0344AB
19,598F766175BE3EF3
20,0644E10571B8CA12
21,5AAC6A858427D04E
22,DA0947682FC19B0B
