stop_order,stop_id
1,001356
2,001357
3,003781
4,001358
5,001359
6,001360
7,001361
8,001375
9,001313
10,001293
11,001315
12,001297
13,001298
14,001299
15,001216
16,001217
17,001218
18,001219
19,001220
20,001336
21,001337
22,001338
23,001223
24,001224
25,001225
26,001362
27,002580
28,001370
29,001382
