stop_order,stop_id
1,24BFA8C2C9E9F5DB
2,21AFFFF707224831
3,31BFA986DE84EDE1
4,3221A3FF8CA898FF
5,0ACB63B00DEE1B37
6,E21A497AF62AF38F
7,CEA9610F9443BD8D
8,06E1120EA9A7BF69
9,91AED9CBCE81500D
10,31B93EAF018D6956
11,F1ED37F1BA6D054F
12,9961C7ED914E87DD
13,69E4C417312C10C0
14,C1E1199805BCC92D
15,A0496DDDC41213FA
