stop_order,stop_id
1,C3427DE8E291FFA6
2,F8D1049558163BE6
3,7703B0499F66B205
4,457C64EC8955C896
5,4A0370F0CA6A89B2
6,997CCAB996935BD7
7,6638A31332E98C83
8,5CCBD9A6B58BF20D
9,E049C81469E2B3C0
10,076E1E9D5874C41D
11,F2BD88B8D506E78A
12,16F899DA5289900D
13,B96E368FC17CD0B0
14,420E7970087AD769
15,520C9836ACAECDF9
16,22FE13158B36FE48
17,67064412B0E9D9A6
18,F646F96A5D18D121
19,5B23A51CA34F4FAD
20,710390556FA80CAD
21,AFE0100DABA53C21
22,BBC5D60D2FB827D2
23,C47ACFA9541AB34F
