stop_order,stop_id
1,8CFD0DAAA2D9B47E
2,D156C558FF163BE3
3,013F884CBCB1CBE4
4,5E082FCF5C58328C
5,E2602DD1C8EA1AC8
6,30553FA19D045D25
7,34740DD5ABC36F12
8,25E1BAE2C272ED4C
9,823E3EE2413E40E2
10,E7133179F5800E85
11,E34E3D48842C9B66
12,DF9E89A391CAC245
13,657E5836BC932790
14,7A1C43F91CF8A6FC
15,60F1DDDCB555E319
16,F7CAA2D4FF9D61F7
17,14F176D358D65A8B
18,8E3A5C15E42020BB
19,96442B84082D4DF5
20,508D99EBC9AB3A9B
21,FE56DD70DEDE0395
22,D2217D7746597D10
23,5D75A800F823B45D
24,1864222D8939BD69
25,2802E2DEE1D48B51
