stop_order,stop_id
1,002305
2,002302
3,002277
4,002278
5,002279
6,002273
7,002270
8,002271
9,002272
10,002380
11,002242
12,002257
13,002241
14,002251
15,002196
16,002198
17,002197
18,002349
19,002353
20,002417
21,002421
22,001074
23,001033
24,001032
