stop_order,stop_id
1,DD696D5A43B30E93
2,DFD604BDABB47600
3,8C7CF1C55484A294
4,A3647D99DA65BA96
5,AF03F8EECD52F273
6,AF61AE97990B5C08
7,4C19E0623146E4F9
8,3523AA15D7F22A3F
9,5E63913862E61D96
10,D137ADD65D333E0B
11,142BE7225B0BB745
12,AFC5E64568DBB2D5
13,A295FD27A4E5A7C5
14,3C624F6CB2D5BBEA
15,C1E9F8237EDBBAD2
16,24E16716BBB7F2D0
17,8F6FD66CC20690DC
