stop_order,stop_id
1,E22B819E638307CC
2,8337F935242C5CC3
3,6BD93B827893E41E
4,3C61E9226688CA79
5,8507CD56EB29D1CF
6,96F3B1A2E2ACE68F
7,1D6A8B8C58C268FF
8,F86BDB236D6ACDC3
9,E18D73287340B634
10,C8811A27E4B64581
11,69263C9DB4729B7F
12,AE6FE615893E8C89
13,3007D34FB91FB27E
14,1AB934EFE0E1470A
15,16CE9E8D17681839
