stop_order,stop_id
1,58C01C52768108CC
2,E6F6DEA4AC4E1E5F
3,F57E1173086C7A51
4,940A31DA2A6051A9
5,62958067B9C06318
6,5419928D472EAD8D
7,4624AC39DB25D456
8,D7C7D86E923EEAE1
9,076E1E9D5874C41D
10,DD161A7AB0D39192
11,3F21ED54F86D9B1D
12,2F202818B5A6F424
13,CDB292D507E4302D
14,C55F50E43F6108EB
15,530F970BB56D778D
16,512C07C3D131AB5A
17,BBFADA4889A61FCC
18,9316961F98692D0A
19,67FC11E66080F9C2
