stop_order,stop_id
1,B15BDCDB640C46BC
2,D17DA49D5EFC6DD4
3,6BCA27BE4E0F904D
4,40A8EA2850B0979B
5,B943DBEE65B0B18F
6,F9475B6C5F5B9C21
7,B18C8718C0B7904F
8,D1A1DF2BDC842EE5
9,33A7AB58611A0F6D
10,B1D6CA16EE22225D
11,3B54D43994CAC165
12,D9655458715EBBF8
13,8374DD78C287D9A7
14,D5252DAD51812506
15,09DF70F8DE2426BE
16,AAB411C52D067AD1
17,6CD14DBE643D2995
18,75F02FF13CC7B34A
19,D6ABAF265F431EB9
20,B09E06FF6EF5A8C4
21,508B02C5E209E802
22,6C11A9780213BBBB
23,B15BDCDB640C46BC
