stop_order,stop_id
1,8370DDFF896AC3E0
2,471AB47F0E2C6E89
3,5AD0EDD70D540E29
4,D7F4AE9D52F68682
5,147EF2F26EFE2BEF
6,0C080F70E16F02B7
7,73755A16EA9076FF
8,F60E8E7D4B29135F
9,4DD9CB2D8C7DB1D8
10,F24C06FAF6EE076F
11,775642281FBFE336
12,B85641FDDED22352
13,8C8037479F88F500
14,EF0567DCF0D20204
15,241BD0C151A1B393
16,0C6879C89662708A
17,3E20F9BD4AB8067F
18,9D65EA81218F7784
19,DC7AC2F4CE4F5059
20,C1528848376F5B95
21,0CC3913BEF225E76
22,97A265C9E6F9AA61
23,29395B362BEDBA1E
24,9394FF939973FB49
25,98197302E98C548E
26,C70342BF7C6A4732
27,0D5759F7A4B185FE
28,C552CE565E1F0C85
29,AAC64BCDD5B55A86
