stop_order,stop_id
1,8BD1BD1B2D687075
2,E796B592A3D045F0
3,18624A8EBAB72722
4,325FDAE396B59480
5,FFBEBD7068E01EA4
6,DBF0C952CAA654B5
7,182976403F291FE0
8,B8760F28D7938609
9,3225E407F87D904C
10,DD5CDB226E98FD0B
11,78A74247AE9B466E
12,A95DD63E3A98FF7F
