stop_order,stop_id
1,09DFD305F09C558E
2,4249ED0CD65130CC
3,3CE4F8574F4F9D72
4,3FD481FB9B9DC36C
5,12E4BAFA2B73435B
6,FFBEBD7068E01EA4
7,DBF0C952CAA654B5
8,182976403F291FE0
9,B8760F28D7938609
10,3225E407F87D904C
11,DD5CDB226E98FD0B
12,78A74247AE9B466E
13,A95DD63E3A98FF7F
