stop_order,stop_id
1,8019E4CBB686CD25
2,ECE98AAA81373891
3,BF4622C022F17E9D
4,D2C5873747260F13
5,34740DD5ABC36F12
6,25E1BAE2C272ED4C
7,823E3EE2413E40E2
8,45AB0EC4F195CA7A
9,620E14F31DA31490
10,09B4297CB90AF3EC
11,3B54D43994CAC165
12,D9655458715EBBF8
13,8374DD78C287D9A7
14,D5252DAD51812506
15,09DF70F8DE2426BE
16,7019D5AE9C63EE72
17,01642BC44DCFDB3C
18,D213B1E60E14A62E
