stop_order,stop_id
1,4A35BB617F75F41D
2,98EBAB9468C80DD2
3,6DD6B837EF1FA76C
4,60952B4A38F3D82E
5,D67917549F3DC8A3
6,30D564180B68ECA8
7,9A0959AB68FA5E1F
8,94358F5481BAE505
9,5D8FCEF2915882FD
10,C2605DED84199B84
11,BF8E440F5584D39D
12,DF04BD4B98EB6153
13,D0F535009C53F787
14,C8FD960431F7210C
15,F36C1B3AC57D96FA
