stop_order,stop_id
1,001792
2,001793
3,001794
4,001795
5,001713
6,001714
7,001717
8,001715
9,001716
10,003074
11,002703
12,003494
13,003495
14,003496
15,001779
16,001654
17,001525
18,001695
19,001690
20,001725
21,001853
22,002714
23,002672
24,003304
25,003482
26,001837
