stop_order,stop_id
1,9EAD90CEBB1036D7
2,066AA1A504714A20
3,D2ACD052AFD5900A
4,8CF45DD1D6B1FA4D
5,A91E6B3E8A9A7B34
6,3C9A7C5FE12B8BCB
7,A7516C49B99EFD78
8,C3672D8D28801773
9,9A412252B10AD2FF
10,CCAD6B9A4B1CFFD8
11,466111DE1A3E4656
12,28B264A688848238
13,709C8604AFB90F27
14,8379C4B1265C27F7
15,B4EBE05A59376062
16,33D9DBB7E4754BFD
17,3E63535258CAA9BB
18,A70E3450F9432F54
19,4C333C4D4E80902B
20,F1A22B170518051B
21,7F0D726107B2540E
22,9F25118F734F288B
23,A10A69465DCE5402
24,1A9362BE56274030
25,498836D151ECC5ED
