stop_order,stop_id
1,716E50EBD1CD72B4
2,AFC36FC71B4E124E
3,CA1C0FB0345F9675
4,A5E559178C9F5182
5,E55FA660A59AB64A
6,E3B0A57678CFD140
7,647CBF3FE0DF2FAE
8,98EBAB9468C80DD2
9,CA1317F5A0B8A8B2
10,AFD29CB1A4F71AB9
11,65ECD19EFD09FB74
12,D67917549F3DC8A3
13,6633B4885C8A3EE7
14,0F3FA9B7D07A91F3
15,C837C3C549793472
16,2AC85D87661D5AF6
17,000CFEE2F92DC17B
18,BA995ECF3EFCA99E
19,879A98CD29D9433F
20,0132863D9F66CE6B
