stop_order,stop_id
1,09680C5849BFA077
2,5D77A5CBE41F2984
3,F6512E7C4A6D5C2E
4,9AC3AFC5216B9711
5,AFB03B10416E2199
6,4B9D547F0F450784
7,7BDF3895E0BCE33B
8,168487E2C681CB0D
9,3942D55ED3DE84C9
10,7C4E16F4A138B142
11,A47333D8B495F77D
12,946C74E30100FE80
13,A0287E3D747AD4FA
14,1CCCE3B2D9AB4D2A
15,5C6ECA890BF03809
16,7A1C43F91CF8A6FC
17,98FCC750B322B706
18,AB741CA56ABEA9F2
19,71C9731001C9C773
20,F63C76EC97E38A91
21,777ED0B1F3CF10DD
22,F5F6D6EF74B4D7B2
23,B96E368FC17CD0B0
24,420E7970087AD769
25,B76B249D3D253008
26,A7F35DC09E1A1528
27,0F4DB224F8A8FF9C
28,4884DCF89AD7BA6A
29,48AA5A2907C1833D
30,7D06FF559C2414AF
31,E4B6BF6D835723A0
32,7CC71E7933DD9625
33,D34CCDD12A1BC57F
34,EE3EA981F3D6485D
35,F159C47896D53738
36,0F38AE1F1CAFF245
37,642A6178B23761B6
38,9E80A1847F06792A
39,661FEE32A0D73EB0
40,2196A42A8F733DB5
41,F0AC02C6C94078C4
42,A0FDF34B2D278750
43,951CE3B3EB98BA3A
44,64CE8117895E8FAD
45,5CD4C77378D3A4AE
46,942E95B4336BDFA7
47,33BA3785390F1457
48,09680C5849BFA077
