stop_order,stop_id
1,09C223E13435C61D
2,5E1FA939586B3FD1
3,86201D4BB45ED201
4,6A22FBF7825E3E7F
5,9BA601064A2EF221
6,CE80C150FB0C40F9
7,BDAEF35D10A3ADC7
8,D01ECABA2E8B3987
9,E6FF7108BC36B5CE
10,190BE384606CC1B5
11,155A8CC00899AB1E
12,77070BA4D8554234
13,2DB24989E9EAF9B7
14,711AE4AC67F88999
15,86E0CB9AE1AF077A
16,F6C81A30F7110D53
