stop_order,stop_id
1,94A3E9298FD887C6
2,10D38620E5CAEBB3
3,9DF152ED984CD4A0
4,DA30F5393480B81D
5,27222F0DE22582ED
6,32C1F605CAAD7861
7,DAC33107054B9FED
8,51D8A415C1DDEB54
9,C32657EA44B5BDBD
10,4398437B28723B0F
11,5998A11C63EAB82E
12,081EB225028BC80B
13,C044260C4C65B4F9
14,F71DE7248DAAFAF7
15,CBC1B13E6C660F57
16,D9803113E5547E6A
17,955D67F4E8E6F94D
18,7F57D17DA2586C52
19,BC008DCE1FFF4A6D
20,DAF2564A31FDC4F0
21,6EE5FF32091CF94A
22,3096269306B60988
23,F527E9ADDEDF39B1
24,298C08C4E1D1E7BF
25,507DA53C608E13A0
26,916501787D3948F1
27,4197D80D370042C2
28,6E1E84A8BAF508AC
29,DB241439B4E2785A
30,3DDE81FE5DB08180
31,45628FA7B8D7C5D2
32,13E458C819D90940
33,A8B4FCB26097BA18
34,CAD1ABCBA72CF365
35,46604706EE6CC765
36,94A3E9298FD887C6
