stop_id,name_en,name_tc,name_sc,lat,long,last_update
1,Mui Wo Ferry Pier,梅窩碼頭,梅窝码头,22.26466400,114.00155400,2023-02-17T19:29:36+0800
2,Mui Wo Cooked Food Market,梅窩熟食市場,梅窝熟食市场,22.26614300,114.00004900,2023-02-17T19:29:36+0800
3,Ngan Wan Estate,銀灣邨,银湾邨,22.26540600,113.99707400,2023-02-17T19:29:36+0800
4,Mui Wo Market,梅窩街市,梅窝街市,22.26675900,113.99699900,2023-02-17T19:29:36+0800
5,Ngan King Centre,銀景中心,银景中心,22.26553700,113.99696500,2023-02-17T19:29:36+0800
6,Silver Mine Bay Water Treatment Works,銀鑛灣濾水廠,银鑛湾滤水厂,22.26296600,113.99782600,2023-02-17T19:29:36+0800
7,Lai Chi Yuen,荔枝園,荔枝园,22.26075800,113.99647700,2023-02-17T19:29:36+0800
8,Nam Shan Sam Uk Tsuen,南山三屋村,南山三屋村,22.25707200,113.99010800,2023-02-17T19:29:36+0800
9,Nam Shan Camp Site,南山營地,南山营地,22.25545100,113.98681100,2023-02-17T19:29:36+0800
10,Swire Staff Holiday House,太古職員宿舍,太古职员宿舍,22.25191800,113.98488700,2023-02-17T19:29:36+0800
11,Pui O Petrol Station,貝澳油站,贝澳油站,22.24731100,113.98098500,2023-02-17T19:29:36+0800
12,Lo Wai Tsuen,老圍村,老围村,22.24425200,113.97923600,2023-02-17T19:29:36+0800
13,Sun Wai Tsuen,新圍村,新围村,22.24347600,113.97817800,2023-02-17T19:29:36+0800
14,Lo Uk Tsuen,羅屋村,罗屋村,22.24319200,113.97488500,2023-02-17T19:29:36+0800
15,Ngau Au Yuen,牛坳園,牛坳园,22.24304100,113.97254500,2023-02-17T19:29:36+0800
16,San Shek Wan 3 1/4 Milestone,散石灣中蘆,散石湾中芦,22.24124400,113.96910500,2023-02-17T19:29:36+0800
17,San Shek Wan Village,散石灣村,散石湾村,22.23892800,113.96677200,2023-02-17T19:29:36+0800
18,YWCA Sydney Leong Holiday Lodge,女青年會梁紹榮度假村,女青年会梁绍荣度假村,22.23748400,113.96400100,2023-02-17T19:29:36+0800
19,Cheung Sha Sheung Tsuen,長沙上村,长沙上村,22.23523800,113.96173900,2023-02-17T19:29:36+0800
20,Cheung Sha Police Headquarters,長沙警署,长沙警署,22.23377200,113.96021100,2023-02-17T19:29:36+0800
21,Cheung Sha Ha Tsuen,長沙下村,长沙下村,22.23478700,113.95723200,2023-02-17T19:29:36+0800
22,Cheung Sha Fire Station,長沙消防局,长沙消防局,22.23663200,113.95434900,2023-02-17T19:29:36+0800
23,Leyburn Villas,麗濱別墅,丽滨别墅,22.23621700,113.95191600,2023-02-17T19:29:36+0800
24,Butterfly Crest,蝶崗,蝶岗,22.23454000,113.94884100,2023-02-17T19:29:36+0800
25,Cheung Sha Bridge,長沙大橋,长沙大桥,22.23338900,113.94697700,2023-02-17T19:29:36+0800
26,Upper Cheung Sha Beach,上長沙海灘,上长沙海滩,22.23087700,113.94152500,2023-02-17T19:29:36+0800
27,Tong Fuk Beach,塘福海灘,塘福海滩,22.22850900,113.93533900,2023-02-17T19:29:36+0800
28,Tong Fuk Village,塘福村,塘福村,22.22756500,113.93270600,2023-02-17T19:29:36+0800
30,Ma Po Ping Village,麻埔坪村,麻埔坪村,22.22992600,113.92805000,2023-02-17T19:29:36+0800
31,Ma Po Ping Road Junction,麻埔坪道口,麻埔坪道口,22.22601800,113.92949500,2023-02-17T19:29:36+0800
32,Tong Fuk Correctional Institution,塘福懲教所,塘福惩教所,22.22876400,113.92608400,2023-02-17T19:29:36+0800
33,Upper Wan Lung,上橫壟,上横垄,22.22334800,113.92062400,2023-02-17T19:29:36+0800
34,Lower Wan Lung,下橫壟,下横垄,22.22230500,113.91974100,2023-02-17T19:29:36+0800
35,Shui Hau Village (East),水口村(東),水口村(东),22.22156500,113.91605900,2023-02-17T19:29:36+0800
36,Shui Hau Village,水口村,水口村,22.22098931,113.91431800,2023-02-17T19:29:36+0800
37,Four-Eye Ma,四眼馬,四眼马,22.22191300,113.91037000,2023-02-17T19:29:36+0800
38,Shui Hau Helicopter Landing Field,水口直升機場,水口直升机场,22.22353200,113.90806300,2023-02-17T19:29:36+0800
39,Shek Pik Police Station,石壁警崗,石壁警岗,22.22586200,113.89772000,2023-02-17T19:29:36+0800
40,Sha Tsui Detention Centre,沙咀懲教所,沙咀惩教所,22.22496900,113.89348700,2023-02-17T19:29:36+0800
41,Sha Tsui,沙咀,沙咀,22.22832800,113.89060000,2023-02-17T19:29:36+0800
42,Shek Pik Au W.W.O. Access Road,石壁坳引水道通道,石壁坳引水道通道,22.23945100,113.89369700,2023-02-17T19:29:36+0800
43,Sham Wat Road Junction,深屈道口,深屈道口,22.24503800,113.89223700,2023-02-17T19:29:36+0800
44,Fat Hwa Yuen,法華苑,法华苑,22.24612200,113.88904200,2023-02-17T19:29:36+0800
45,Sam Yuen Ching Shea,三緣精舍,三缘精舍,22.24643500,113.88624200,2023-02-17T19:29:36+0800
46,Shing Fai Orchard,成輝果園,成辉果园,22.24382000,113.88420900,2023-02-17T19:29:36+0800
47,Kwun Yam Monastery,觀音寺,观音寺,22.24225600,113.88299100,2023-02-17T19:29:36+0800
48,Lung Chai,龍仔,龙仔,22.24081600,113.88102200,2023-02-17T19:29:36+0800
49,Keung Shan Management Centre,羌山管理站,羌山管理站,22.24203200,113.87882300,2023-02-17T19:29:36+0800
51,Ling Yan Monastery,靈隱寺,灵隐寺,22.24401800,113.87500900,2023-02-17T19:29:36+0800
52,Hang Mei,坑尾,坑尾,22.25065600,113.86906200,2023-02-17T19:29:36+0800
53,Buddhist Fat Ho Memorial College,佛教筏可紀念中學,佛教筏可纪念中学,22.25203300,113.86698800,2023-02-17T19:29:36+0800
54,Lung Tin Estate,龍田邨,龙田邨,22.25232600,113.86497600,2023-02-17T19:29:36+0800
55,Tai O,大澳,大澳,22.25278300,113.86216000,2023-02-17T19:29:36+0800
56,Lai Chi Yuen Cemetery,禮智園墳場,礼智园坟场,22.25932700,113.99399300,2023-02-17T19:29:36+0800
57,Mui Wo Police Station,梅窩警署,梅窝警署,22.26409300,113.99890600,2023-02-17T19:29:36+0800
58,Sham Wat Road,深屈道,深屈道,22.24505400,113.89119300,2023-02-17T19:29:36+0800
59,San Hoi Ting,山海亭,山海亭,22.24947700,113.89305300,2023-02-17T19:29:36+0800
60,Ngong Ping Village,昂坪市集,昂坪市集,22.25546100,113.90398100,2023-02-17T19:29:36+0800
62,Ngong Ping,昂坪,昂坪,22.25561200,113.90286200,2023-02-17T19:29:36+0800
64,Cheung Sha Catchwater,長沙引水道,长沙引水道,22.23981400,113.95721600,2023-02-17T19:29:36+0800
65,Pak Kung Au,伯公坳,伯公坳,22.24805400,113.94313900,2023-02-17T19:29:36+0800
66,Tung Chung Au Management Centre,東涌坳管理站,东涌坳管理站,22.26400600,113.93715500,2023-02-17T19:29:36+0800
67,Cemetery Area No. 18,十八區墳場,十八区坟场,22.26546600,113.93646300,2023-02-17T19:29:36+0800
68,Shek Mun Kap Road,石門甲道,石门甲道,22.26991800,113.93424300,2023-02-17T19:29:36+0800
69,Lung Tseng Tau,龍井頭,龙井头,22.27597500,113.93337700,2023-02-17T19:29:36+0800
70,Wong Ka Wai,黃家圍,黄家围,22.27716200,113.93381200,2023-02-17T19:29:36+0800
71,Ha Ling Pei,下嶺皮,下岭皮,22.27873100,113.93547500,2023-02-17T19:29:36+0800
72,Sheung Ling Pei,上嶺皮,上岭皮,22.27891200,113.93685600,2023-02-17T19:29:36+0800
73,Tung Chung Rural Committee Office,東涌鄉事委員會,东涌乡事委员会,22.27913800,113.93929900,2023-02-17T19:29:36+0800
74,Ma Wan Sun Tsuen,馬灣新村,马湾新村,22.27986500,113.94024300,2023-02-17T19:29:36+0800
76,North Lantau Hospital (South Bound),北大嶼山醫院(南行),北大屿山医院(南行),22.28186100,113.93880300,2023-02-17T19:29:36+0800
77,Tung Chung Fire Station,東涌消防局,东涌消防局,22.28603000,113.94105700,2023-02-17T19:29:36+0800
78,Tung Chung Cable Car Terminal,東涌纜車站,东涌缆车站,22.28930100,113.93873300,2023-02-17T19:29:36+0800
79,Tung Chung Station Bus Terminus,東涌站巴士總站,东涌站巴士总站,22.28986200,113.93961600,2023-02-17T19:29:36+0800
80,Fu Tung Plaza,富東廣場,富东广场,22.28887000,113.94210500,2023-02-17T19:29:36+0800
81,Yu Tung Court,裕東苑,裕东苑,22.28607700,113.94160300,2023-02-17T19:29:36+0800
83,San Shek Wan Roundabout,散石灣迴旋處,散石湾回旋处,22.23654400,113.96255000,2023-02-17T19:29:36+0800
84,Sun Fung Tsuen,新鳳村,新凤村,22.24357100,113.87697200,2023-02-17T19:29:36+0800
88,"Kui Yat House, Yat Tung Estate",逸東邨居逸樓,逸东邨居逸楼,22.28236900,113.93657600,2023-02-17T19:29:36+0800
89,Yat Tung Estate,逸東邨,逸东邨,22.28205300,113.93586200,2023-02-17T19:29:36+0800
90,Yu Tai Court,裕泰苑,裕泰苑,22.28056500,113.94106400,2023-02-17T19:29:36+0800
91,Chek Lap Kok New Village,赤立角新村,赤立角新村,22.27770400,113.94199600,2023-02-17T19:29:36+0800
92,Shek Mun Kap Village,石門甲村,石门甲村,22.26940400,113.93199600,2023-02-17T19:29:36+0800
93,Shek Mun Kap,石門甲,石门甲,22.26905700,113.93118500,2023-02-17T19:29:36+0800
94,Tung Chung Rural Committee Office,東涌鄉事委員會,东涌乡事委员会,22.27893600,113.93879500,2023-02-17T19:29:36+0800
95,Siu Ho Wan,小蠔灣,小蚝湾,22.31551900,113.99797500,2023-02-17T19:29:36+0800
96,Siu Ho Wan Water Treatment Works,小蠔灣濾水廠,小蚝湾滤水厂,22.31359500,113.99573400,2023-02-17T19:29:36+0800
97,Discovery Bay Tunnel,愉景灣隧道,愉景湾隧道,22.31002200,113.99058400,2023-02-17T19:29:36+0800
98,Government Maintenance Depot,政府維修廠,政府维修厂,22.30893500,113.98945100,2023-02-17T19:29:36+0800
99,Pak Mong,白芒,白芒,22.29796400,113.96758000,2023-02-17T19:29:36+0800
100,Citygate,東薈城,东薈城,22.29013600,113.94147400,2023-02-17T19:29:36+0800
101,Chung Yat Street,松逸街,松逸街,22.27616400,113.93182300,2023-02-17T19:29:36+0800
102,Chung Mun Road,松滿路,松满路,22.27720100,113.93170000,2023-02-17T19:29:36+0800
103,"Fuk Yat House, Yat Tung Estate",逸東邨福逸樓,逸东邨福逸楼,22.27921600,113.93465100,2023-02-17T19:29:36+0800
104,"Yung Yat House, Yat Tung Estate",逸東邨雍逸樓,逸东邨雍逸楼,22.27959200,113.93671200,2023-02-17T19:29:36+0800
105,Tung Chung MTR Station,東涌港鐵站,东涌港铁站,22.28961300,113.94021000,2023-02-17T19:29:36+0800
106,Tung Chung Development Ferry Pier,東涌發展碼頭,东涌发展码头,22.29384600,113.94044900,2023-02-17T19:29:36+0800
107,Seaview Crescent,海堤灣畔,海堤湾畔,22.29292500,113.94347100,2023-02-17T19:29:36+0800
108,Coastal Skyline,藍天海岸,蓝天海岸,22.29094200,113.94593100,2023-02-17T19:29:36+0800
109,Caribbean Coast Phase 2,映灣園二期,映湾园二期,22.29188200,113.95001000,2023-02-17T19:29:36+0800
110,Kin Tung Road,健東路,健东路,22.29322200,113.94941000,2023-02-17T19:29:36+0800
111,Yi Tung Road,怡東路,怡东路,22.29094900,113.94801200,2023-02-17T19:29:36+0800
112,E Wun Secondary School,怡文中學,怡文中学,22.29085000,113.94461100,2023-02-17T19:29:36+0800
114,Aviation Fuel Tank Farm,飛機燃料庫,飞机燃料库,22.29358400,113.93212900,2023-02-17T19:29:36+0800
115,Cathay City,國泰城,国泰城,22.29754600,113.93281400,2023-02-17T19:29:36+0800
116,Gate House No. 2,二號檢查閘,二号检查闸,22.31053500,113.93710700,2023-02-17T19:29:36+0800
117,Airport (Passenger Terminal Building),機場(客運大樓),机场(客运大楼),22.31456900,113.93661000,2023-02-17T19:29:36+0800
118,Cheong Tat Road,暢達路,畅达路,22.31623600,113.93594800,2023-02-17T19:29:36+0800
120,Regal Airport Hotel,富豪機場酒店,富豪机场酒店,22.31943000,113.93394200,2023-02-17T19:29:36+0800
121,Chek Lap Kok South Road,赤鱲角南路,赤鱲角南路,22.29188300,113.92825100,2023-02-17T19:29:36+0800
122,Asia Airfreight Terminal,亞洲空運中心,亚洲空运中心,22.29606500,113.92080600,2023-02-17T19:29:36+0800
124,Airport Freight Forwarding Centre,機場空運中心,机场空运中心,22.29501600,113.92332900,2023-02-17T19:29:36+0800
125,HACTL,香港空運貨站,香港空运货站,22.29712400,113.92978400,2023-02-17T19:29:36+0800
126,Airport Freight Forwarding Centre,機場空運中心,机场空运中心,22.29500500,113.92434000,2023-02-17T19:29:36+0800
127,Hung Hom (Hung Luen Road),紅磡 (紅鸞道),红磡 (红鸾道),22.30141600,114.18809200,2023-02-17T19:29:36+0800
128,East Tsim Sha Tsui MTR Station,尖東港鐵站,尖东港铁站,22.29479800,114.17438000,2023-02-17T19:29:36+0800
129,Kowloon Park,九龍公園,九龙公园,22.29872100,114.17192800,2023-02-17T19:29:36+0800
131,Prince Edward MTR Station,太子港鐵站,太子港铁站,22.32581600,114.16787600,2023-02-17T19:29:36+0800
132,Yen Chow Street,欽州街,钦州街,22.33129900,114.16136900,2023-02-17T19:29:36+0800
134,Yuen Long MTR Station,元朗港鐵站,元朗港铁站,22.44615300,114.03388800,2023-02-17T19:29:36+0800
135,Yau San Street,又新街,又新街,22.44430800,114.03125200,2023-02-17T19:29:36+0800
136,Tai Tong Road,大棠路,大棠路,22.44435500,114.02825500,2023-02-17T19:29:36+0800
137,Yuen Long Police Station,元朗警署,元朗警署,22.44438300,114.02408500,2023-02-17T19:29:36+0800
138,Shui Pin Tsuen,水邊村,水边村,22.44440700,114.02078100,2023-02-17T19:29:36+0800
139,Yuen Long Park,元朗公園,元朗公园,22.44411700,114.01901300,2023-02-17T19:29:36+0800
140,Long Bin,朗邊,朗边,22.44338600,114.01479900,2023-02-17T19:29:36+0800
141,Ping Shan,屏山,屏山,22.44167400,114.01037800,2023-02-17T19:29:36+0800
142,San Hei Tsuen,新起村,新起村,22.44001900,114.00763600,2023-02-17T19:29:36+0800
143,Fui Sha Wai,灰沙圍,灰沙围,22.43851400,114.00465400,2023-02-17T19:29:36+0800
144,Tai Tao Tsuen,大道村,大道村,22.43645100,114.00145900,2023-02-17T19:29:36+0800
145,Hung Shui Kiu LTR Station,洪水橋輕鐵站,洪水桥轻铁站,22.43385800,113.99775000,2023-02-17T19:29:36+0800
146,Chung Uk Tsuen LTR Station,鍾屋村輕鐵站,钟屋村轻铁站,22.42967300,113.99223500,2023-02-17T19:29:36+0800
147,Yick Yuen Tsuen,亦園村,亦园村,22.42716800,113.98972800,2023-02-17T19:29:36+0800
148,Nai Wai,泥圍,泥围,22.42362300,113.98679600,2023-02-17T19:29:36+0800
149,Fuk Hang Tsuen,福亨村,福亨村,22.42236000,113.98564000,2023-02-17T19:29:36+0800
150,Miu Fat Buddhist Monastery,妙法寺,妙法寺,22.42043900,113.98387800,2023-02-17T19:29:36+0800
151,Lam Tei LTR Station,藍地輕鐵站,蓝地轻铁站,22.41832800,113.98238500,2023-02-17T19:29:36+0800
152,Shenzhen Bay Port,深圳灣口岸,深圳湾口岸,22.49743300,113.95050900,2023-02-17T19:29:36+0800
153,Tsing Chuen Wai,青磚圍,青砖围,22.42245200,113.98530500,2023-02-17T19:29:36+0800
154,Nai Wai LTR Station,泥圍輕鐵站,泥围轻铁站,22.42364800,113.98631300,2023-02-17T19:29:36+0800
155,Tong Fong Tsuen LRT Station,塘坊村輕鐵站,塘坊村轻铁站,22.44021000,114.00731200,2023-02-17T19:29:36+0800
156,Ping Shan LRT Station,屏山輕鐵站,屏山轻铁站,22.44321600,114.01293000,2023-02-17T19:29:36+0800
157,Villa By The Park,朗庭園,朗庭园,22.44425900,114.01818900,2023-02-17T19:29:36+0800
158,Hi Lee Path,喜利徑,喜利径,22.44465400,114.02580200,2023-02-17T19:29:36+0800
159,Tung Lok Street,同樂街,同乐街,22.44462900,114.02822500,2023-02-17T19:29:36+0800
160,Kuk Ting Street,谷亭街,谷亭街,22.44457800,114.03023000,2023-02-17T19:29:36+0800
161,Yuen Long MTR Station,元朗港鐵站,元朗港铁站,22.44618900,114.03481600,2023-02-17T19:29:36+0800
162,Tin Shui Wai (Tin Tsz Estate),天水圍 (天慈邨),天水围 (天慈邨),22.45353600,114.00711100,2023-02-17T19:29:36+0800
163,Harbour Plaza Resort City,嘉湖海逸酒店,嘉湖海逸酒店,22.45860500,114.00326000,2023-02-17T19:29:36+0800
164,Tin Shui Wai Town Centre,天水圍市中心,天水围市中心,22.45849800,114.00199400,2023-02-17T19:29:36+0800
165,"Chestwood Court, Kingswood Villas",嘉湖山莊翠湖居,嘉湖山庄翠湖居,22.45959500,113.99998400,2023-02-17T19:29:36+0800
166,Tin Shui Estate,天瑞邨,天瑞邨,22.45699400,113.99885700,2023-02-17T19:29:36+0800
167,Tin Shui Wai Park,天水圍公園,天水围公园,22.45455700,114.00254300,2023-02-17T19:29:36+0800
168,"Yiu Shing House, Tin Yiu Estate",天耀邨耀盛樓,天耀邨耀盛楼,22.45222100,114.00216500,2023-02-17T19:29:36+0800
169,"Yiu Man House, Tin Yiu Estate",天耀邨耀民樓,天耀邨耀民楼,22.44955000,114.00317400,2023-02-17T19:29:36+0800
170,Tin Shing Court,天盛苑,天盛苑,22.44698800,114.00279400,2023-02-17T19:29:36+0800
171,Tin Shui Wai Police Station,天水圍警署,天水围警署,22.45017100,114.00250400,2023-02-17T19:29:36+0800
172,"Sherwood Court, Kingswood Villas",嘉湖山莊賞湖居,嘉湖山庄赏湖居,22.45255000,114.00216900,2023-02-17T19:29:36+0800
173,Tin Chung Court,天頌苑,天颂苑,22.45986400,114.00007900,2023-02-17T19:29:36+0800
174,"Lynwood Court, Kingswood Villas",嘉湖山莊麗湖居,嘉湖山庄丽湖居,22.45893400,114.00359200,2023-02-17T19:29:36+0800
175,"Kenswood Court, Kingswood Villas",嘉湖山莊景湖居,嘉湖山庄景湖居,22.45736400,114.00579700,2023-02-17T19:29:36+0800
176,Tin Shui Wai (Tin Yiu Estate),天水圍 (天耀邨),天水围 (天耀邨),22.45053000,114.00302900,2023-02-17T19:29:36+0800
178,South Lantau Sea Cable Station,南大嶼山海底電纜站,南大屿山海底电缆站,22.22527200,113.92866100,2023-02-17T19:29:36+0800
179,Tung Chung Road,東涌道,东涌道,22.23791800,113.96292000,2023-02-17T19:29:36+0800
180,Pui O,貝澳,贝澳,22.24309100,113.97712400,2023-02-17T19:29:36+0800
181,Tong Fuk,塘福,塘福,22.22761600,113.93228900,2023-02-17T19:29:36+0800
183,Nelson Street,奶路臣街,奶路臣街,22.31801800,114.16951500,2023-02-17T19:29:36+0800
184,Yee Kok Court,怡閣苑,怡阁苑,22.33389400,114.15804300,2023-02-17T19:29:36+0800
185,"North Lantau Hospital (North Bound), Mei Yat House Yat Tung Estate","北大嶼山醫院(北行), 逸東邨美逸樓","北大屿山医院(北行), 逸东邨美逸楼",22.28129500,113.93882200,2023-02-17T19:29:36+0800
186,Caribbean Coast Phase 3,映灣園三期,映湾园三期,22.29142400,113.94897500,2023-02-17T19:29:36+0800
187,Chun Wan Road South,駿運南路,骏运南路,22.29631900,113.92846900,2023-02-17T19:29:36+0800
188,North Lantau Hospital(Main Block),北大嶼山醫院(主座大樓),北大屿山医院(主座大楼),22.28202800,113.93926900,2023-02-17T19:29:36+0800
190,The Visionary(North Bound),昇薈(北行),升薈(北行),22.29582300,113.95190700,2023-02-17T19:29:36+0800
191,The Visionary (South Bound),昇薈(南行),升薈(南行),22.29583500,113.95207700,2023-02-17T19:29:36+0800
192,Ying Hei Road,迎禧路,迎禧路,22.29431000,113.94999600,2023-02-17T19:29:36+0800
193,Ying Tung Estate,迎東邨,迎东邨,22.29710400,113.95334200,2023-02-17T19:29:36+0800
194,Caribbean Coast Phase 1,映灣園一期,映湾园一期,22.29349500,113.95181600,2023-02-17T19:29:36+0800
195,Yick Yuen Tsuen,亦園村,亦园村,22.42739600,113.99036600,2023-02-17T19:29:36+0800
196,Lam Tei LTR Station,藍地輕鐵站,蓝地轻铁站,22.41844400,113.98214600,2023-02-17T19:29:36+0800
197,Fui Sha Wai,灰沙圍,灰沙围,22.43866900,114.00540400,2023-02-17T19:29:36+0800
199,Tai Tao Tsuen,大道村,大道村,22.43653300,114.00211500,2023-02-17T19:29:36+0800
200,Hung Shui Kiu LTR Station,洪水橋輕鐵站,洪水桥轻铁站,22.43351800,113.99781500,2023-02-17T19:29:36+0800
201,Chung Uk Tsuen LTR Station,鍾屋村輕鐵站,钟屋村轻铁站,22.42958700,113.99258700,2023-02-17T19:29:36+0800
203,Tin Shui Wai (Tin Tsz Estate),天水圍 (天慈邨),天水围 (天慈邨),22.45353600,114.00711100,2023-02-17T19:29:36+0800
205,Tin Shui Estate,天瑞邨,天瑞邨,22.45659700,113.99943400,2023-02-17T19:29:36+0800
206,Tin Shui Wai Park,天水圍公園,天水围公园,22.45455500,114.00305500,2023-02-17T19:29:36+0800
207,Tin Shing Court,天盛苑,天盛苑,22.44669700,114.00300000,2023-02-17T19:29:36+0800
221,Tai O,大澳,大澳,22.25278300,113.86216000,2023-02-17T19:29:36+0800
222,Lung Tin Estate,龍田邨,龙田邨,22.25252100,113.86500500,2023-02-17T19:29:36+0800
224,Hang Mei,坑尾,坑尾,22.25083200,113.86930600,2023-02-17T19:29:36+0800
225,Ling Yan Monastery,靈隱寺,灵隐寺,22.24428700,113.87510700,2023-02-17T19:29:36+0800
226,Sun Fung Tsuen,新鳳村,新凤村,22.24390000,113.87700600,2023-02-17T19:29:36+0800
227,Keung Shan Management Centre,羌山管理站,羌山管理站,22.24218200,113.87905100,2023-02-17T19:29:36+0800
228,Lung Chai,龍仔,龙仔,22.24137000,113.88139200,2023-02-17T19:29:36+0800
229,Shing Fai Orchard,成輝果園,成辉果园,22.24400100,113.88399500,2023-02-17T19:29:36+0800
230,Sam Yuen Ching Shea,三緣精舍,三缘精舍,22.24671100,113.88596800,2023-02-17T19:29:36+0800
232,Fat Hwa Yuen,法華苑,法华苑,22.24622100,113.88887200,2023-02-17T19:29:36+0800
233,Sham Wat Road,深屈道,深屈道,22.24459200,113.89187900,2023-02-17T19:29:36+0800
234,Shek Pik Au W.W.O. Access Road,石壁坳引水道通道,石壁坳引水道通道,22.23917900,113.89397500,2023-02-17T19:29:36+0800
235,Sha Tsui,沙咀,沙咀,22.22850300,113.89110500,2023-02-17T19:29:36+0800
236,Shek Pik Police Station,石壁警崗,石壁警岗,22.22611900,113.89813400,2023-02-17T19:29:36+0800
237,Shui Hau Helicopter Landing Field,水口直升機場,水口直升机场,22.22370300,113.90832500,2023-02-17T19:29:36+0800
238,Four-Eye Ma,四眼馬,四眼马,22.22205400,113.91063200,2023-02-17T19:29:36+0800
239,Shui Hau Village,水口村,水口村,22.22110100,113.91417300,2023-02-17T19:29:36+0800
240,Shui Hau Village (East),水口村(東),水口村(东),22.22184100,113.91576300,2023-02-17T19:29:36+0800
241,Lower Wan Lung,下橫壟,下横垄,22.22205000,113.91923400,2023-02-17T19:29:36+0800
242,Upper Wan Lung,上橫壟,上横垄,22.22435800,113.92107700,2023-02-17T19:29:36+0800
243,South Lantau Sea Cable Station,南大嶼山海底電纜站,南大屿山海底电缆站,22.22588300,113.92718000,2023-02-17T19:29:36+0800
244,Ma Po Ping Road Junction,麻埔坪道口,麻埔坪道口,22.22658300,113.93007700,2023-02-17T19:29:36+0800
245,Tong Fuk Village,塘福村,塘福村,22.22776300,113.93239700,2023-02-17T19:29:36+0800
246,Tong Fuk Beach,塘福海灘,塘福海滩,22.22894100,113.93594400,2023-02-17T19:29:36+0800
247,Upper Cheung Sha Beach,上長沙海灘,上长沙海滩,22.23132900,113.94176600,2023-02-17T19:29:36+0800
248,Cheung Sha Bridge,長沙大橋,长沙大桥,22.23397900,113.94736600,2023-02-17T19:29:36+0800
249,Butterfly Crest,蝶崗,蝶岗,22.23506200,113.94929800,2023-02-17T19:29:36+0800
250,Leyburn Villas,麗濱別墅,丽滨别墅,22.23647200,113.95142400,2023-02-17T19:29:36+0800
251,Cheung Sha Fire Station,長沙消防局,长沙消防局,22.23680300,113.95543400,2023-02-17T19:29:36+0800
252,Cheung Sha Ha Tsuen,長沙下村,长沙下村,22.23496500,113.95717000,2023-02-17T19:29:36+0800
253,Cheung Sha Police Headquarters,長沙警署,长沙警署,22.23396400,113.96017400,2023-02-17T19:29:36+0800
254,Cheung Sha Sheung Tsuen,長沙上村,长沙上村,22.23533000,113.96154700,2023-02-17T19:29:36+0800
255,San Shek Wan Roundabout,散石灣迴旋處,散石湾回旋处,22.23672700,113.96242400,2023-02-17T19:29:36+0800
256,YWCA Sydney Leong Holiday Lodge,女青年會梁紹榮度假村,女青年会梁绍荣度假村,22.23776800,113.96397300,2023-02-17T19:29:36+0800
257,San Shek Wan Village,散石灣村,散石湾村,22.23902400,113.96652600,2023-02-17T19:29:36+0800
258,San Shek Wan 3 1/4 Milestone,散石灣中蘆,散石湾中芦,22.24125500,113.96866600,2023-02-17T19:29:36+0800
259,Lo Uk Tsuen,羅屋村,罗屋村,22.24337500,113.97483200,2023-02-17T19:29:36+0800
260,Sun Wai Tsuen,新圍村,新围村,22.24347600,113.97732200,2023-02-17T19:29:36+0800
261,Lo Wai Tsuen,老圍村,老围村,22.24444000,113.97900000,2023-02-17T19:29:36+0800
262,Pui O Petrol Station,貝澳油站,贝澳油站,22.24750100,113.98077000,2023-02-17T19:29:36+0800
263,Swire Staff Holiday House,太古職員宿舍,太古职员宿舍,22.25212000,113.98474500,2023-02-17T19:29:36+0800
264,Nam Shan Camp Site,南山營地,南山营地,22.25606700,113.98747000,2023-02-17T19:29:36+0800
265,Nam Shan Sam Uk Tsuen,南山三屋村,南山三屋村,22.25732700,113.98990100,2023-02-17T19:29:36+0800
266,Lai Chi Yuen,荔枝園,荔枝园,22.26066700,113.99626800,2023-02-17T19:29:36+0800
269,Sham Wat Road Junction,深屈道口,深屈道口,22.24520700,113.89208900,2023-02-17T19:29:36+0800
270,Ngong Ping,昂坪,昂坪,22.25561200,113.90286200,2023-02-17T19:29:36+0800
271,San Hoi Ting,山海亭,山海亭,22.24931300,113.89284000,2023-02-17T19:29:36+0800
273,Cheung Sha Catchwater,長沙引水道,长沙引水道,22.24000700,113.95733900,2023-02-17T19:29:36+0800
274,Cathay City,國泰城,国泰城,22.29755500,113.93336000,2023-02-17T19:29:36+0800
276,Chek Lap Kok South Road,赤鱲角南路,赤鱲角南路,22.29197000,113.92875900,2023-02-17T19:29:36+0800
277,Aviation Fuel Tank Farm,飛機燃料庫,飞机燃料库,22.29307500,113.93222900,2023-02-17T19:29:36+0800
278,Tung Chung Station Bus Terminus,東涌站巴士總站,东涌站巴士总站,22.28986200,113.93961600,2023-02-17T19:29:36+0800
279,Sheung Ling Pei,上嶺皮,上岭皮,22.27879200,113.93714800,2023-02-17T19:29:36+0800
280,Ha Ling Pei,下嶺皮,下岭皮,22.27851200,113.93542300,2023-02-17T19:29:36+0800
282,Wong Ka Wai,黃家圍,黄家围,22.27703800,113.93397500,2023-02-17T19:29:36+0800
283,Lung Tseng Tau,龍井頭,龙井头,22.27570700,113.93370700,2023-02-17T19:29:36+0800
284,Shek Mun Kap Road,石門甲道,石门甲道,22.27047000,113.93446500,2023-02-17T19:29:36+0800
286,Cemetery Area No. 18,十八區墳場,十八区坟场,22.26567800,113.93674000,2023-02-17T19:29:36+0800
287,Tung Chung Au Management Centre,東涌坳管理站,东涌坳管理站,22.26410400,113.93755200,2023-02-17T19:29:36+0800
288,Pak Kung Au,伯公坳,伯公坳,22.24893900,113.94259700,2023-02-17T19:29:36+0800
289,Yat Tung Estate,逸東邨,逸东邨,22.28205300,113.93586200,2023-02-17T19:29:36+0800
291,Shek Mun Kap,石門甲,石门甲,22.26905700,113.93118500,2023-02-17T19:29:36+0800
292,Shek Mun Kap Village,石門甲村,石门甲村,22.26957500,113.93197800,2023-02-17T19:29:36+0800
293,Siu Ho Wan,小蠔灣,小蚝湾,22.31551900,113.99797500,2023-02-17T19:29:36+0800
294,Government Maintenance Depot,政府維修廠,政府维修厂,22.30928300,113.98925400,2023-02-17T19:29:36+0800
295,Pak Mong,白芒,白芒,22.29796400,113.96758000,2023-02-17T19:29:36+0800
297,Ying Tung Estate,迎東邨,迎东邨,22.29710400,113.95334200,2023-02-17T19:29:36+0800
298,Caribbean Coast Phase 2,映灣園二期,映湾园二期,22.29193200,113.95049000,2023-02-17T19:29:36+0800
299,Seaview Crescent,海堤灣畔,海堤湾畔,22.29303900,113.94317900,2023-02-17T19:29:36+0800
302,Uptown,尚城,尚城,22.43530000,114.00031400,2023-02-17T19:29:36+0800
303,Century Link,東環,东环,22.29439800,113.94907100,2023-02-17T19:29:36+0800
305,Mui Wo Ferry Pier,梅窩碼頭,梅窝码头,22.26466400,114.00155400,2023-02-17T19:29:36+0800
306,"Yung Yat House, Yat Tung Estate",逸東邨雍逸樓,逸东邨雍逸楼,22.27974400,113.93699500,2023-02-17T19:29:36+0800
307,HZMB Hong Kong Port,大橋香港口岸,大桥香港口岸,22.31640000,113.95085600,2023-02-17T19:29:36+0800
308,HZMB Hong Kong Port Passenger Clearance Building,大橋香港口岸旅檢大樓,大桥香港口岸旅检大楼,22.31721100,113.95053100,2023-02-17T19:29:36+0800
309,Mun Tung Estate,滿東邨,满东邨,22.27865300,113.93320300,2023-02-17T19:29:36+0800
310,Mun Tung Estate,滿東邨,满东邨,22.27892200,113.93455600,2023-02-17T19:29:36+0800
311,AsiaWorld-Expo,機場博覽館,机场博览馆,22.31932300,113.94044600,2023-02-17T19:29:36+0800
312,Hong Kong SkyCity Marriott Hotel,香港天際萬豪酒店,香港天际万豪酒店,22.31777700,113.94331700,2023-02-17T19:29:36+0800
313,HZMB Hong Kong Port,大橋香港口岸,大桥香港口岸,22.31640000,113.95085600,2023-02-17T19:29:36+0800
315,Caribbean Coast,映灣園,映湾园,22.29322200,113.94941000,2023-02-17T19:29:36+0800
317,Tung Chung Tat Tung Road Bus Terminus,東涌達東路巴士總站,东涌达东路巴士总站,22.29058000,113.93935200,2023-02-17T19:29:36+0800
318,Tung Chung Tat Tung Road Bus Terminus,東涌達東路巴士總站,东涌达东路巴士总站,22.29058000,113.93935200,2023-02-17T19:29:36+0800
319,Tung Chung Development Ferry Pier,東涌發展碼頭,东涌发展码头,22.29384600,113.94044900,2023-02-17T19:29:36+0800
320,"North Lantau Hospital (North Bound), Mei Yat House Yat Tung Estate","北大嶼山醫院(北行), 逸東邨美逸樓","北大屿山医院(北行), 逸东邨美逸楼",22.28129500,113.93882200,2023-02-17T19:29:36+0800
321,Tung Chung Cable Car Terminal,東涌纜車站,东涌缆车站,22.28930100,113.93873300,2023-02-17T19:29:36+0800
322,North Lantau Hospital (South Bound),北大嶼山醫院(南行),北大屿山医院(南行),22.28186100,113.93880300,2023-02-17T19:29:36+0800
324,Yu Nga Court,裕雅苑,裕雅苑,22.29419400,113.94725400,2023-02-17T19:29:36+0800
327,Disneyland,迪士尼樂園,迪士尼乐园,22.31635600,114.04573200,2023-02-17T19:29:36+0800
328,Disneyland,迪士尼樂園,迪士尼乐园,22.31635600,114.04573200,2023-02-17T19:29:36+0800
