stop_order,stop_id
1,3418D6822E151335
2,620E14F31DA31490
3,5FDA47671B5557B3
4,0269A1F9D98C737E
5,47FF0EDCD6926932
6,64312A5DFF11636C
7,CB2A65E69B2B71BE
8,59081A58EA5BC728
9,5D14B75687F60509
10,79D68EE7C6CBAB9D
11,7A501670303C90F8
