stop_order,stop_id
1,498C8934EAACBE51
2,73FE2D32F218DA9C
3,1BE574CAE40EFF17
4,797CC0222B9EFBEF
5,308112BE50081258
6,D2425B7147B58E1D
7,A4607B71730E8F46
8,021872C0E263AC46
9,189AC37A164008A6
10,7E2E1F1269E520DE
11,ED364A58F885DC92
12,D6C06E7091666AB4
13,F8D8D0AED9889278
14,2D33D39F61B74C5D
15,AAB411C52D067AD1
16,558D298696B57A4D
17,898337E6181E5E66
18,4E3FEA4E559A5D16
19,BB04686A2E0D7578
20,952DD8539E6DAC75
21,E3AB394138EDE467
22,F275A85A9CF9BBC4
23,8C87D5196ECC1057
