stop_order,stopId
1,307
2,117
3,118
4,120
5,274
6,277
7,78
8,79
9,80
10,81
11,90
12,94
13,279
14,280
15,282
16,283
17,284
18,286
19,287
20,288
21,273
22,83
23,19
24,20
25,21
26,22
27,23
28,24
29,25
30,26
31,27
32,28
33,246
34,247
35,248
36,249
37,250
38,251
39,252
40,253
41,254
42,255
43,256
44,257
45,258
46,259
47,260
48,261
49,262
50,263
51,264
52,265
53,56
54,266
55,57
56,2
57,3
58,4
59,5
60,305
