stop_order,stop_id
1,494C28331301B811
2,1DE77C91B7ED381E
3,7B3074F34B2D6D01
4,98AB21EAFF27FE09
5,62A80759AABB1937
6,9A773DDB814933C1
7,C163B1F33533C2A9
8,6A225A9CB16BC4BB
9,3F34A16B40CB1C7F
10,75004E87386729D7
11,DE56F722C9293A68
12,D01D18C6EB79F84B
13,68A3AF80BADFDE9F
14,AB741CA56ABEA9F2
15,853C70D76FF68196
16,1924C09B20B8787A
17,987B3A45E05CD6EE
18,4FDF5E1EC677A66C
19,BC3B37FDEE7EE51B
20,5CE1C1296F98C6C4
21,3D403F8CF70C7FE4
22,C0ACDED85452CFC8
23,6E9A9467758898B7
24,2A9C98A6B36F3B11
25,7F3A1FC5F4533B4C
26,E907FA24426A9FD6
27,8C44D48B9BAAB774
28,300D1812E3A085C3
29,1B7B9EDF492B37B6
30,5CA7841E84D52C8A
31,22138E6C8051FDBD
32,520C9836ACAECDF9
33,22FE13158B36FE48
34,67064412B0E9D9A6
35,242DFDBDBFA2034A
36,EF568D9658FEF62C
37,CC14CF9E8A163F34
38,CC9AE3EF28E5725F
39,2D30B4FAF44D2398
40,494C28331301B811
