stop_order,stop_id
1,E8A145669A392955
2,060A70079F196C7C
3,1F934873940D1F49
4,C9E264A3F9D4CEB3
5,558D298696B57A4D
6,364529AB163D8609
7,9217F5E1950F12BF
8,F1934936E2AB96E4
9,AEF88DA61C0553EE
10,D198122830A4FDE3
11,99EF4CA10B3E1F17
12,9FD865B00B2D54A1
13,64CE8117895E8FAD
14,29740CCBBD82FC33
15,466BC4C1908A1A06
16,2FFC93C766E566B5
17,F5A61D37E2DDA9D8
18,31079A9B244C679B
19,ABC15E2110BF7A49
20,932D83E09BF6ADE6
21,3366C1DC458401B3
22,4D30DF225016CBB0
23,12B9E30ED892A35A
24,D13C7436B13B4A4B
25,EC9467FAB4EC7203
26,4E279C21A109E9E3
27,F282012BBB2865E5
28,B550EC84B77440F8
29,20FDDA894D722F88
30,4E7C1C7F6D191BCB
31,CC2353289CD0EE66
32,815BC43527FD9247
33,B3F2EC8E42FA3184
34,2307DECBF51E9D7F
35,13B87ED5725EE00D
36,4A195F954ACD67C5
37,27EF80951F8ED49E
