stop_order,stop_id
1,C95F46AD9BB057BC
2,96BA48FFCBDB7791
3,2208DE69AD7B38DA
4,C355E5F825B9864F
5,38B4D64E5D9DA9AB
6,7C27E54D8AEC683A
7,659365A8AB2B98E9
8,3227505D6CDA32C9
9,7906D320A27CAD88
10,EC839AE65935149B
11,AE4E8F82AD65348C
12,225E8FAE869B3308
13,4A626ACD36F8ED7A
14,153D32217234A0F0
15,893BBB901005C3E6
16,BBE77B90CE43AEFA
17,246B98B8B9F002F0
18,3B7368AAB82CC612
19,730AB612DCDF58C8
20,1A85A6C132C4197F
21,C3FD63E226246052
22,098AF67CBBB9FBA9
23,0BADB28A19C2E0BE
24,A1AA846971415968
25,6762DEA1B89E6354
26,70349D91EC82AFE1
27,E35B5F1B80E085E6
28,EBEF10F95443B217
29,636F6AAF3B891E82
