stop_order,stop_id
1,D63D9356CBA8B0CD
2,AE4D7869B643DAA2
3,AE2A53D953B640BE
4,E798CB4E2C777782
5,6E8CB58283AF3CB1
6,9CFB5F7232818FFA
7,A06590AD808DC9A9
8,06C9926B2E2B304F
9,F948129B464BB963
10,73D995FCB1FFF157
11,0DE359EA64DEF296
12,76B4054F2E1F00B0
