stop_order,stop_id
1,595CE3974AB6F377
2,0AFB254B4CDB9348
3,8FA8E142E834CB7C
4,92A09EC9B712A1ED
5,4885700825A72F51
6,A1541789F09C89BA
7,D073CC71A1B4F79C
8,B64EEA7F564C7853
9,46D1A9FD1F84CA5C
10,BDD49A91FF705B42
11,DD56DC2336C878C1
12,8121695666A4D9CE
13,C2787E27F82716BF
14,2560149CE75EABA0
15,ACB5FEA2BF9FC5AD
16,72F743E4D464E498
17,28B264A688848238
18,B8CAE7A1372554AB
19,D996531BBC23B44D
20,EE2334043E6E8184
21,EF111F2EC49F64AE
22,AD1B202B678A3B56
23,B30799FB3732222B
24,4C333C4D4E80902B
25,F1A22B170518051B
26,69F0130ADB11EF8B
27,17B98BD1165A7B92
