stop_order,stop_id
1,6436DFC118C4367A
2,FFB52BC25F0AB482
3,46CB01C7F12428A3
4,D5FEF340EE98A7E8
5,3FCC00D1D01ACD28
6,AD1B202B678A3B56
7,C88DEC0AF0D1102B
8,B241331CC87A36D4
9,B4F3F0D547580CE2
10,F1A22B170518051B
11,3DB9E473F29FCDEE
12,84C5EBC00642536A
13,678E66E67D8F1989
14,5256A9BB88266375
15,816F423684877612
16,A92AC5D798836D40
17,C44D3424473B96F6
18,D678B3364437D16B
19,9C839C3824F47A6A
20,CB4BB0008A87E4FC
21,40FF132FB8E77051
22,B08CA4B3CDCF142A
23,CF18D17DE7B40350
24,736E84A8060D2AB9
25,CB4B52222877C32F
26,6B9496267BEFF02A
27,B9D7AE7CB0C56556
28,DA29C9192B8D12DC
29,23727783D2D3E994
30,EF17FDCDDF170D38
31,F73D15363D3CA881
