stop_order,stop_id
1,001603
2,001777
3,001692
4,001595
5,002877
6,002860
7,003513
8,003514
9,003515
10,003516
11,001616
12,003517
13,002875
14,003061
15,003062
16,003406
17,003063
18,001572
19,001573
20,002976
21,003506
22,003370
23,003537
24,003507
