stop_order,stop_id
1,002277
2,002378
3,002387
4,002175
5,002180
6,002178
7,002177
8,002397
9,002194
10,002192
11,002272
12,002380
13,002242
14,002257
15,002241
16,002251
17,002196
18,002198
19,002197
20,002349
21,002352
22,002354
23,002225
24,002355
25,002222
26,002389
27,002390
28,002357
29,002358
30,002160
31,002161
32,002162
33,002163
34,002261
35,002226
36,002227
37,002228
38,002229
39,002230
40,002231
41,002232
42,001109
43,001110
44,001111
45,001112
46,001113
47,001114
48,002758
49,001190
50,001628
51,003762
52,003763
53,001400
54,001403
55,002626
56,002627
57,001587
58,001540
