stop_order,stop_id
1,5D7809204099960C
2,5B04604E989BBDF0
3,64303D83BDF8C92F
4,C9A46DDC082BAEE0
5,ABF9301D1E5B52ED
6,266A4CDA19461A42
7,8C79BE154468AE21
8,26A996F589C84844
9,F374B56E275194D8
10,AD0B5EFA2471962C
11,9274EF6791CA3ED8
12,0F3FA9B7D07A91F3
13,000CFEE2F92DC17B
14,53BB93AAB2D45F3B
15,6C2DBC45160AA4BF
16,E5F082F4C7300273
17,18FB32A8BE19CB57
18,753E63DCB2FFD3B2
19,0BB054192087F527
20,EAEA62781C49856C
21,D395E730FC3A3473
22,EA6152DD7165E9DC
23,9B07890D73E13AE4
24,1927F52F4ED872E5
25,F8619A3F780D4072
26,3A3B108F799F3326
27,7F8CEE1F02103A4A
28,74A2E12A2DC55FE0
29,5CEC0EA1BB2D6D11
30,D3EBFAC0D6EE8DD5
31,84891259878A06F5
32,C7C774CD6AE937B1
33,24FEF0BD13752095
34,552DA8FCE732ABF0
35,ADB789C140CFBE00
36,37AEC610CEBCEA48
37,8EA1F6CDA69E539C
38,AC1FD9BDD09D1DD6
