stop_order,stop_id
1,DAE04FEC0D09BED6
2,A9E1D35DB7FC7C7B
3,246B32CF201C6A7A
4,C185612B431B197A
5,A4C9136D18013389
6,0D39977C225DD2D5
7,AC30AF0DFC95D507
8,A0FDF34B2D278750
9,951CE3B3EB98BA3A
10,3BB1407BA61E0A9B
11,0D625148EFD58C10
12,29ED2073D6C52B5A
13,DBF0C952CAA654B5
14,C9109584C37A5B98
15,970DA2E578488682
16,D2F2B3C5436007C2
17,EC2573EE5FF42AAC
18,74EE2ECB1A3773E9
19,ED3477DD255C1DE7
