stop_order,stop_id
1,001698
2,001695
3,001690
4,001524
5,003006
6,003007
7,003008
8,003014
9,003009
10,003010
11,003011
12,003012
13,003013
14,001625
15,001626
16,002719
17,001580
18,001581
19,001537
20,002558
21,002487
22,002569
23,002488
24,002489
25,001140
26,001142
27,001054
28,001056
29,001175
30,001040
31,001066
32,001067
33,001068
34,001069
35,001070
36,001082
37,001083
38,001005
39,002590
40,001177
