stop_order,stop_id
1,001913
2,002031
3,001885
4,001886
5,001887
6,001888
7,001889
8,001890
9,001891
10,001892
11,002048
12,002049
13,001893
14,001894
15,003363
16,002603
17,002604
18,002606
19,002608
20,002675
21,002611
22,002613
23,002614
24,002616
25,002618
26,001629
27,001028
28,001029
29,001030
30,001139
31,001174
32,002427
33,002432
34,002435
35,002438
36,002535
37,002536
