stop_order,stop_id
1,002378
2,002387
3,002175
4,002180
5,002178
6,002177
7,002375
8,002377
9,002397
10,002194
11,002192
12,002272
13,002380
14,002242
15,002257
16,002241
17,002251
18,002381
19,002249
20,002246
21,002370
22,002255
23,002258
24,002544
25,002545
26,002546
27,002506
28,002507
29,002508
30,002509
31,002510
32,002487
33,002569
34,002488
35,002489
36,001140
37,002596
38,001106
39,001032
