stop_order,stop_id
1,C8A9DAB5E9051324
2,924D67DD8AB7683D
3,E7BFF1027930CCCD
4,6D76E141FB820044
5,F2E381299EA74E3E
6,1276AEF95F6564A2
7,2A72F4041A7E6783
8,480DB16994F8FFEE
9,FD8181D7574BB373
10,7B3074F34B2D6D01
11,98AB21EAFF27FE09
12,77B8325F08F1FFAA
13,1A85B99EDE6D01D8
14,04FC6E130D4953F4
15,EEBBD352B7F16E3F
16,4A1EEF2271FA16D3
