stop_order,stop_id
1,002337
2,002382
3,002340
4,002401
5,003287
6,002157
7,002158
8,002159
9,002343
10,002344
11,002383
12,002345
13,002347
14,003429
15,002467
16,002437
17,002555
18,001213
19,001251
20,002414
21,001475
22,001578
23,001579
24,001617
25,001618
26,001619
27,001620
28,001621
29,001932
30,001924
31,001925
32,001908
33,001909
34,001910
35,001928
36,001952
37,001962
38,002046
