stop_order,stop_id
1,E30B8672A91A50B9
2,E74202351AF7F37D
3,9DA98A5E3914E2E3
4,92C62E07455F7C6C
5,1FFFFBAE28F48D03
6,CCBCD7F613287BC8
7,B4372FB3544677BB
8,913E96996F3B7E3A
9,328C9939240A94CA
10,58C47FBFFF12E65F
11,4AEB8A22E18AB111
12,AE4423E551C360BF
13,9DE043DB23CEDAA8
14,D678B3364437D16B
15,2EF9764BE18FC290
16,F1A90CEE2B8C40CC
17,6530130BE25E909C
18,D3FEF85E4DAEEE4E
19,C3201264CC8E5C5D
20,C8830886D41FB5FA
21,9615800192F1667C
22,D17050E8964504BB
23,04DDF4F7F1C74876
24,BF08F9C08BB54A2B
25,5FF5FCFD1121F033
26,B809C24DC8C87767
27,3BA4DBB4520188DF
28,FA5C305D16B299A5
