stop_order,stop_id
1,17F010FBF594E572
2,E1F73A6B69F39365
3,02D4D2C0C430EAD0
4,60F6F482EFA8FE18
5,C6A76DB999AF1213
6,C7C1C12D89968698
7,326199D24220A42B
8,C847B9021C407731
9,38330C642568FE3F
10,96A6FE5F07BDF203
11,9DE875FD17C67097
12,68B207DDC9A182AB
13,060699911C9E300F
14,9E256D7EE9FE68BC
15,DF942A6B97EABDC4
16,2DDD1CB69E981669
17,80B56E2C7719DAF4
18,71E3EB7E709522C7
19,8D0555A78A132018
20,2FCE924121B95FE8
