stop_order,stop_id
1,F3D86A2A72FF3582
2,8E8DB91C885F1230
3,940A31DA2A6051A9
4,4A38244491180BF7
5,5419928D472EAD8D
6,357B7D41501CDACA
7,DF10BE627F25E7DD
8,D7C7D86E923EEAE1
9,088B858E4B54D8AC
10,05D8591BD5405ED4
11,258EDF9D3C3FD200
12,5CA7841E84D52C8A
13,22138E6C8051FDBD
14,E68FF6CC803A14A2
15,613ED01D077362A9
16,66B8F73D3F4E91C9
17,8EE5AC5D519C140E
18,944A9ADFCA286511
19,808CA5FECCC6646D
20,860026BE357B5462
21,4BFB5F2D496CDA56
22,51FCE282462E418B
23,F8BB84BC801E4C85
24,BC39BFC3C7BC3009
25,2FABE52A66DF7482
26,C1E1199805BCC92D
27,F0852C7827CC97EB
