stop_order,stop_id
1,8013D41156BC24BD
2,4E870B220826BEE0
3,5AD2A4D21C226335
4,A454170B2B59B587
5,973EBE6A3543C701
6,21A1859E80CD542A
7,466111DE1A3E4656
8,CE1BEC7176C47D52
9,4FCF8ED4A60F9769
10,77D08D8DF5A80932
11,04601C2FB7201CAA
12,E74202351AF7F37D
13,85D7313CCE53D396
14,36904A9AD2C13B32
15,1F3870BB293E9DAF
16,DB3C788ACBB6668D
17,DF901EF2F9A46F7B
18,6F206EE9D2AF0838
