stop_order,stop_id
1,7188D2451C5AF461
2,E70EDF92FE8553E2
3,D52BE142BBBD69D9
4,2C7BF1ADFCFB5545
5,671775E6AF279B42
6,4B17C55C032D3A37
7,266A4CDA19461A42
8,99D25E17B32126B4
9,DCC8F8655EB76754
10,AA6F0A2661759A49
11,846488D96E25F4D3
12,1DF17F085C6C1B78
13,7917BB962CCB11C0
14,E435F72ACB8438ED
15,60A445D9ACD40C12
16,118450CCC68E42C6
17,6AAC8E541D9BD80C
18,643D73028E9E8490
19,0D7A1D0AECA1D999
20,D813C93D9AD1C45B
21,7BB395B6FE66E102
22,6D4E7B9D5F9584E7
23,47AB1894215AECEE
24,42AEF6365E78DA56
25,8753A8442C2FFF53
26,1BE574CAE40EFF17
27,797CC0222B9EFBEF
28,308112BE50081258
29,B10F5697E4DA810B
30,1DAF9282E63CDEC2
