stop_order,stop_id
1,B37FC6600B2254B6
2,060A70079F196C7C
3,1F934873940D1F49
4,C9E264A3F9D4CEB3
5,558D298696B57A4D
6,364529AB163D8609
7,9217F5E1950F12BF
8,F1934936E2AB96E4
9,AEF88DA61C0553EE
10,D198122830A4FDE3
11,99EF4CA10B3E1F17
12,9FD865B00B2D54A1
13,64CE8117895E8FAD
14,29740CCBBD82FC33
15,466BC4C1908A1A06
16,2FFC93C766E566B5
17,F5A61D37E2DDA9D8
18,31079A9B244C679B
19,ABC15E2110BF7A49
20,932D83E09BF6ADE6
21,3366C1DC458401B3
22,B64E0F355A9F4223
23,FC42DCBDC3AB0B6F
24,22E2678081E88368
25,7613538D58A9C452
26,336FF66D1F0AC4A0
27,54FCA9F5D8F3587E
28,711927A9FAEF1158
29,F09FF6C6349030C6
30,D13C7436B13B4A4B
31,EC9467FAB4EC7203
32,21AD38E162AE7E57
