stop_order,stop_id
1,2802E2DEE1D48B51
2,FE2815CBCD21C57C
3,F2508598F5A43655
4,3313287185163530
5,8E8DB91C885F1230
6,4A38244491180BF7
7,5419928D472EAD8D
8,357B7D41501CDACA
9,D7C7D86E923EEAE1
10,A76BB6FCB881AF5C
11,0F4F935A9F14F111
12,136480342AAF0BD2
13,32CCEDBCC9EAAA9E
14,2751781A6F757C5D
15,6045969736940272
16,38A53BACD13CD0C8
17,A8C8FB27A0399D63
18,C53A00F15DC2DB20
19,48E5A1EED91712EE
20,D099C45C9443AFC8
21,45D0CFA28B3FEFE5
22,91481C9100917BA7
23,40829C12642639D4
24,16A7F2C343AA6DE6
25,4B0E21EDF07F9C83
26,1CF4AE2F7045B848
27,CB667DC000F66D40
28,5E073AD8BC9F2AC8
29,B31E6B9D8E5B4493
30,3A450B5AD5AF1605
31,0E2175C0750054FE
32,0D4E07F475845DB3
33,8CFD0DAAA2D9B47E
