stop_order,stop_id
1,5E1FA939586B3FD1
2,09C223E13435C61D
3,6A22FBF7825E3E7F
4,9BA601064A2EF221
5,CE80C150FB0C40F9
6,BDAEF35D10A3ADC7
7,D01ECABA2E8B3987
8,E6FF7108BC36B5CE
9,190BE384606CC1B5
10,155A8CC00899AB1E
11,77070BA4D8554234
12,2DB24989E9EAF9B7
13,711AE4AC67F88999
14,86E0CB9AE1AF077A
15,708870108A511AF7
