stop_order,stop_id
1,B94A85EF9F1C8E92
2,857F6F958A96DCDB
3,3A450B5AD5AF1605
4,0E2175C0750054FE
5,A90443FD0C19C4B1
6,0CB1F7979192FBB2
7,2C5CA5F47FB6EB3F
8,6B775855F6FB16D9
9,40C9465E380F04C5
10,C67E139743E66D71
11,58BC7AA90028AAD9
12,8249FC875132E1FA
13,92680F8CE20F8FDB
14,46E8837F566582D2
15,94BA9F1C0A85C1B3
16,16A08A7452834C0F
17,888D5E0DD7261BB3
18,C7548A3C37ADC1AA
19,7BA7AF0DB4924B4E
20,A8526F930120F94A
21,D4D5DDEE7B735D83
22,23B5C67999C778E0
23,378A8EA13D10FB05
