stop_order,stop_id
1,9E42D981C59B5762
2,AFC36FC71B4E124E
3,CA1C0FB0345F9675
4,88E5894981B2D9D8
5,3A9EE9221AB3E27C
6,7192051038B36F08
7,6E24D2D895228AC3
8,CA60760D2303E6D0
9,3F21ED54F86D9B1D
10,897B26110ECE76B3
11,A66159E033DDEA04
12,C92E80A5D7E0E8EC
13,07ADFF84F3502690
14,B6B1AB47AB07887F
15,CCC5BAA6257BBDAA
16,D9111A160E3787AB
17,19521C0A1CA93C52
18,B0007A6CF106CA4B
