stop_order,stop_id
1,8F5D8F5379BAD19C
2,60012869923EEE68
3,1B5E6822783B914B
4,36904A9AD2C13B32
5,CCBCD7F613287BC8
6,B4372FB3544677BB
7,913E96996F3B7E3A
8,328C9939240A94CA
9,58C47FBFFF12E65F
10,4AEB8A22E18AB111
11,AE4423E551C360BF
12,9DE043DB23CEDAA8
13,991E47DBD416B908
14,C57C924EEB5463E5
15,02CF8D1FE31E9A09
16,B8E228521E55C7C5
17,40829C12642639D4
18,16A7F2C343AA6DE6
19,4B0E21EDF07F9C83
20,1CF4AE2F7045B848
21,6F5592E4FF8A35E8
22,857F6F958A96DCDB
23,B31E6B9D8E5B4493
24,46D02E1C1CD82C9A
25,5E082FCF5C58328C
26,4B5F39DBC6671C81
27,0C81107C4ABFCD56
