stop_order,stop_id
1,001207
2,001389
3,002693
4,001301
5,001302
6,001303
7,001367
8,001288
9,001271
10,001365
11,001274
12,001276
13,001277
14,001279
15,001280
16,001364
17,001283
18,001286
19,001215
20,002554
21,002440
22,002404
23,002405
24,001475
25,001769
26,001547
27,001549
28,001553
29,001554
30,001555
31,001426
32,001429
33,002810
34,001602
35,002813
36,002845
37,002846
38,001434
39,001685
