stop_order,stop_id
1,12C9A74EEAE58238
2,EF5A5CD9C3A038C9
3,A5E27C280260D008
4,B9343464EDE68947
5,8A25BDD80CA7201C
6,C9051FC04690CD7F
7,1D093403B1F24DF7
8,9C1D2401E1E06544
9,47B6BE5FC95C2042
10,EBE826ABDCE44F0C
11,0C063E408709A8D3
12,811D4A91C1134CEA
13,100E6F60BAC1BDEB
14,BA03816A38B9DA7F
15,4BD5CE5106BB0697
16,6465DE9EE57F6C94
17,3E73B73B12E25DCF
18,38B86AC474D1060D
19,0B8C52E4C34E3B64
20,144E9479168069DD
21,F36C1B3AC57D96FA
22,B1B0E08245C0FC15
23,2E2AD8BFE00F9FAB
24,3CB982FBC9E50AAA
25,F49FA120DE5E6582
26,1EF0671DB830C59D
27,23727783D2D3E994
28,EF17FDCDDF170D38
29,B3B4603C5AD48682
