stop_order,stop_id
1,02D4D2C0C430EAD0
2,C8A9DAB5E9051324
3,924D67DD8AB7683D
4,E7BFF1027930CCCD
5,4654E57A8E9D32EB
6,1276AEF95F6564A2
7,2A72F4041A7E6783
8,E18D73287340B634
9,F4D2D9D3575AECF6
10,69263C9DB4729B7F
11,3219906E32C16E0A
12,B7EE8C907E1E50C0
13,60012869923EEE68
14,85D7313CCE53D396
15,36904A9AD2C13B32
16,CCBCD7F613287BC8
