stop_order,stop_id
1,81657B3B0CB3D4C0
2,FC6CB9607D36FBD7
3,A67D189D438E1534
4,100141C63A642F1A
5,5407432C01D5436D
6,D1CF96D7F9E6E0D3
7,03C2FCE0BF616CB6
8,F772B9044DD2F773
9,012BE724358D1EE1
10,66011988F615D538
11,155F1F0445747AE7
12,E97F002DCFA395B1
