stop_order,stop_id
1,90551F12E553D27E
2,728473DC37894BC6
3,88D65C5F0985F8D9
4,FA265A8238AD5E8D
5,05FE00A97E0CF001
6,AC0BDA78C106FF7A
7,277DD90A63454F48
8,77D21A8395AAC001
9,31418DC3F19236BF
10,7EF6409F758445C9
11,E2DCF1384581ED07
12,AAC64BCDD5B55A86
13,A99B6BB7F1628A08
14,C05A618A6C13350B
15,7BEEBCE35DFFAB7C
16,9DCBD34740D95B23
17,9C9F817064169CE7
18,61C957321A4DE4A9
19,18CA599721E67265
20,57DB1124DEF92894
21,2253B10FD05B01AB
22,FF47BD49B38911D4
23,FAC118A395652466
24,1A74AE460E7BEA16
25,E57DD4F0FE9A1E61
26,90551F12E553D27E
