stop_order,stop_id
1,E0DFAE50EDDD2AAF
2,42B28B8C4C1227A3
3,6F11F73C749338DB
4,98EBAB9468C80DD2
5,CA1317F5A0B8A8B2
6,AFD29CB1A4F71AB9
7,65ECD19EFD09FB74
8,3325529D981E23A1
9,A4455CCA999A234C
10,3C821C86ADED2B9D
11,8237ED597A8A948B
12,D0FB28B8EED62431
13,C7120BD9A94B4F6A
14,825199DC3BC0C5A3
15,A8F178C255CF9783
16,ADB9356BBF06F7C7
17,8E3F5AE0A97053F9
18,F8D7946AFDBA377E
19,E0DFAE50EDDD2AAF
