stop_order,stop_id
1,003155
2,001316
3,001297
4,001298
5,001299
6,002770
7,001216
8,001217
9,001317
10,001318
11,001319
12,001320
13,002291
14,002290
15,002292
16,002285
17,002284
18,002280
19,002276
20,002281
21,002303
22,002304
23,002305
24,002302
25,002359
26,002362
27,002578
28,002400
29,002937
30,002579
31,002385
32,002360
33,002304
34,002305
35,002302
36,002275
37,002378
