stop_order,stop_id
1,001596
2,003301
3,001589
4,001543
5,001544
6,001547
7,001549
8,001553
9,001554
10,001555
11,001425
12,001428
13,001430
14,001431
15,001433
16,001517
17,002033
18,001853
19,002714
20,003550
21,003540
