stop_order,stop_id
1,D187AB3DC52090EF
2,40CC41621D07AA2D
3,6E8CB58283AF3CB1
4,5FFF428D657F1361
5,A06590AD808DC9A9
6,032C7D86DF9ED3AC
7,742D35CD1DEA10FD
8,8B5745F31A5778D7
9,D15281453EE5E0B4
10,A0424645102B1D9C
11,9D0E44D3210264C3
12,EC2573EE5FF42AAC
13,C0B3CCF700EDA89C
14,3D3122319983EAC4
