stop_order,stop_id
1,F2EDDDB17B1EA974
2,CA8554613AAA6C49
3,AAB411C52D067AD1
4,094D2EBC017EE61A
5,E919C0B67C6ACF3F
6,257A6E19DD7F156C
7,28A57C043C111604
8,F82CDE4D15A43CA3
9,DEDD6247441C8C05
10,81B719F7DC3F0FAD
11,C8276DF869656712
12,0F3FA9B7D07A91F3
13,C837C3C549793472
14,9BE3D659E4C144D2
15,000CFEE2F92DC17B
16,53BB93AAB2D45F3B
17,6C2DBC45160AA4BF
18,E5F082F4C7300273
19,91E946260F8BCBE8
20,A911ACA189669DB4
21,91E946260F8BCBE8
