stop_order,stop_id
1,27F96537744C6792
2,1C6EAAF5F48167F9
3,A0D379E172F5BC93
4,853CD1316EB5227B
5,BE6EC9708F5FB613
6,548DB838B4673D93
7,823E3EE2413E40E2
8,45AB0EC4F195CA7A
9,620E14F31DA31490
10,5FDA47671B5557B3
11,0269A1F9D98C737E
12,47FF0EDCD6926932
13,64312A5DFF11636C
14,CB2A65E69B2B71BE
15,59081A58EA5BC728
16,5D14B75687F60509
17,79D68EE7C6CBAB9D
