stop_order,stop_id
1,3F06E3B155C6A4BF
2,5C1471822EE10AF3
3,5FAF9DC59A28A8B1
4,906F89BBA32AEF7E
5,3D5712E812B2A644
6,BB5C1DCDD6B2BC9D
7,C539A7A9365F64D0
8,51B7D1F60A5BA724
9,4BD11538EEA40F55
10,073E1DD8599E7315
11,41FA91EC4FFF5A19
12,0DCC18C3A018C1DA
13,75767448DA6FA081
14,4073C7B5B3D72456
15,A1D5C0FDCC39AFF8
16,D678B3364437D16B
17,2EF9764BE18FC290
18,F1A90CEE2B8C40CC
19,45C2286729E1475B
20,DBEA3F848C7981F2
21,84BACA14B0C50790
22,03F7818C0E176C55
23,06834C0C275F4DDC
