stop_order,stop_id
1,D7D5103D53D4ED90
2,7995F69FE44D0DB3
3,F90ED764C7A95649
4,558599642E78BB9B
5,BEEBDDB542A7E709
6,48184733EFE9D3E3
7,1F2E60EDB4254D30
8,D066F149BE3A1D28
9,1B9CA570385CC6F2
10,E5E7111594073DE2
11,B0668BFF6178BA0B
12,AA97FFC49AE957A5
13,416B7606A9A5FEEB
14,D4707218581C0F72
15,B68FB7076BB07A22
16,553D370FA21F7DA4
17,72999453ECAC4693
18,64D3081966987039
