stop_order,stop_id
1,163F0E101B13D8AD
2,5A95921B376A97CB
3,84BACA14B0C50790
4,7FF51CFDFA30964A
5,34DCAF51F6056BB6
6,9E54416DFC0C7B68
7,B4B94159F6B89A6B
8,B7FD59E0DC385B38
9,C80FB453C9F53569
10,D64C1350EE61A2AD
11,D187AB3DC52090EF
12,40CC41621D07AA2D
13,6E8CB58283AF3CB1
14,5FFF428D657F1361
15,A06590AD808DC9A9
16,032C7D86DF9ED3AC
17,742D35CD1DEA10FD
18,8B5745F31A5778D7
19,164F83410B45C24B
20,FDC2D737183E7C09
21,B1DE024B06DE2EC7
22,3B487B85E3F07416
23,D6D316FEAEC6793A
24,D95C76946ACCA9D6
25,9893491C31F043D0
26,3688FF86BC378100
27,2FB030D696912BE5
28,3EBA2CD3F372A531
29,1EE69CF61423B432
30,2BAE0D3A6CF25EB8
31,FED5FC9BD7B35D53
32,3015AF669161ADBF
33,5CE3ECA0F9501DAB
