stop_order,stop_id
1,001700
2,002908
3,001672
4,001726
5,001727
6,001754
7,003589
8,001494
9,001495
10,001500
11,001695
12,001690
13,001524
14,001761
15,001765
16,001725
17,001853
18,002714
19,003550
20,003540
