stop_order,stop_id
1,215D99B3E2A5F8DD
2,736E84A8060D2AB9
3,CB4B52222877C32F
4,6B9496267BEFF02A
5,5ACB622335DF5AE7
6,DA29C9192B8D12DC
7,1E27754A297197EC
8,3EF537320681EE89
9,6C6B36F7550907CE
10,47266DB98060A64E
11,179C182ADEF1070D
12,7A95C545D0393126
13,558599642E78BB9B
14,BEEBDDB542A7E709
15,48184733EFE9D3E3
16,8E8DB91C885F1230
17,E3A083E4F64D93CD
18,2EEB9CB69FB6A58D
19,0CC0B21EFF42EE19
20,FF46CB6182028AC6
