stop_order,stop_id
1,EB230097DC71925D
2,2DF5E48438A56E56
3,D7D5360A9A0C5D6A
4,C0B0B597A9C896F7
5,A6657A42304B7520
6,06D3396F1F07B07D
7,48105C2BE18DAD7F
8,5BDD937FB8FA0D9E
9,EAAE29D7F756462B
10,5E580B759FCA6CA2
11,79AFB35F9DBD485A
12,DB6314F9E2C2A7EA
13,BC3B37FDEE7EE51B
14,5CE1C1296F98C6C4
15,E24537CF3879CD25
16,C0ACDED85452CFC8
17,6E9A9467758898B7
18,7E4F1063E27B47E9
19,53E36C4D07C3E49C
