stop_order,stop_id
1,001196
2,001176
3,001137
4,002427
5,002432
6,002434
7,002435
8,002437
9,002555
10,001213
11,001259
12,001260
13,001261
14,001263
15,001264
16,001464
17,001985
18,003673
19,003674
20,003675
21,003676
22,003677
23,003678
24,003679
25,003680
26,003681
27,003682
28,003660
