stop_order,stop_id
1,3D8A0FB3051B32EC
2,551DEE0C7120DECD
3,916501787D3948F1
4,4197D80D370042C2
5,6E1E84A8BAF508AC
6,DB241439B4E2785A
7,378DA3C43904CFF9
8,9FBD2D7974A0AB50
9,1A0BF02F827F6A20
10,6DE63371E5E799BA
11,42A5DBE7D21EADE3
12,3FD481FB9B9DC36C
13,12E4BAFA2B73435B
14,74648B92E0E80E2E
15,4DD5EC5516B360D7
16,33ABA49F0E91A247
17,B34F59A0270AEDA4
18,B644204AEDE7A031
19,1C6EAAF5F48167F9
20,A0D379E172F5BC93
21,853CD1316EB5227B
22,BE6EC9708F5FB613
23,CB667DC000F66D40
24,857F6F958A96DCDB
25,3A450B5AD5AF1605
26,0E2175C0750054FE
27,A90443FD0C19C4B1
28,89E9AB03B639BC10
