stop_order,stop_id
1,79E9234905D6F856
2,517D0A232BB15633
3,AAAF715A5DC3A7CD
4,3406C1A9DA760403
5,0FC2713372030A4C
6,B085DDE8E381E370
7,DE99B27530D1A3C4
8,A25160BA84EE09F7
9,972145F4BB2B535F
10,8EAD803DDD2C3BBA
11,DAE9E14BA67CEC80
12,3A5C336CCB38A3FA
13,7BA304A9D0662541
14,943DA171019723CE
15,495A6186451A78E3
16,B71D38598F3C942D
17,783CE18C333C6069
18,7BE18698D0E8FDCE
19,8748720365CEA134
20,25B94D808EC232D8
21,2F165341B07CBDB9
22,FD1B403FD4EC3E8D
23,83C964C7AF464F05
