stop_order,stop_id
1,A371827CA951848F
2,F139E189918C1F86
3,52B02EAC7AAB23C1
4,3F6F5DC1DDA5F68E
5,242122B5F1B7E9C0
6,6953AEF8B3921959
7,620E14F31DA31490
8,26D2833891C00F40
9,0A1DAEAFFDFF0B66
10,3A2924B2461D053B
11,066AA1A504714A20
12,1423FCFF61709EAC
13,898337E6181E5E66
14,9217F5E1950F12BF
15,9985A4A51DFA3079
16,45A499CD3132E90A
17,434BB67EF7BCA912
18,B596DF51C1BDDB19
19,7FE0FCDBF45276EF
20,7D41FC4EE12CB8FD
21,9CF00A30796B6B2B
22,FB948853081A003E
23,4C5AD92665CBCF5D
24,29EC0D6F48E5BCDA
25,4242A06B3D8849D9
26,DB0C71DA23871216
