stop_order,stop_id
1,002591
2,001227
3,001228
4,001339
5,001340
6,001341
7,001387
8,001229
9,001230
10,001231
11,001232
12,001233
13,002417
14,002421
15,001074
16,001033
17,001181
18,001036
19,001185
20,001170
21,001195
22,001145
