stop_order,stop_id
1,010D8E1BE34538EE
2,76BE3FDBD820CCB7
3,0ED8503933F861D8
4,CEFDCD673C8E07B4
5,85CB8068F5EE5C72
6,A1034BF3E773BB68
7,E75C2398E14CDF56
8,EC715C570AB11722
9,384A48BF88CB0637
10,C13E78D5B5FB0F1D
11,7616C33B0351F02D
12,1FBF3DA8236B5F45
13,46B0816B0E9F641E
14,31DAC3984E4C18EA
15,7E4358262A4F586A
16,BE5555129B3758C5
17,DCE0DAF77EBA1E21
18,4A182203F1AD6C2E
19,153D32217234A0F0
20,893BBB901005C3E6
21,BBE77B90CE43AEFA
22,3A43E432D0588F79
23,221A18C37331E6FD
24,3C50188583DABFC8
25,EA59A314ABB9386E
26,1D70AD74F1C97404
27,8B2FD4BDD627C211
28,0EF525CD78152127
29,2F8A93ADDCEF6856
30,BBC5D60D2FB827D2
31,FDBA2A7F174E08F5
32,930E7A721D133F71
33,DAB449CCCBA93789
