stop_order,stop_id
1,048D6486FD28B9F4
2,CA5AEC11C96BA678
3,BE4CE56A7102816E
4,A88D8F59960E3B4C
5,A3647D99DA65BA96
6,AF03F8EECD52F273
7,924D67DD8AB7683D
8,E7BFF1027930CCCD
9,F2E381299EA74E3E
10,AF61AE97990B5C08
11,3F6F5DC1DDA5F68E
12,66B8F73D3F4E91C9
13,8EE5AC5D519C140E
14,5221837D08C7B586
15,C8649AADD889000A
