stop_order,stop_id
1,241A8AC2A2889D05
2,E3965CA6EFD60F36
3,3E83DFEBD7CBF285
4,90C3A9DB72F244DE
5,6CABA5931F619356
6,7476BFC6F6B5D869
7,F7FB52860229BBAB
8,A6DF150EE61DC8B3
9,65B934D14EA190F1
10,7B98BAE3D93817AC
11,82A8D65E4B7DA67C
12,A9203545EC3AD6EE
13,74381FC9E2AFB379
14,337C68B5F413E04E
15,64E7A52D975DF3FF
16,1F109678B4866926
17,E3825DF066FCABC4
18,2BF5780A30BB85E1
19,C9109584C37A5B98
20,458A5CD02E6008EC
21,E532860B16A18F3C
22,FDC2D737183E7C09
23,B1DE024B06DE2EC7
24,3B487B85E3F07416
25,D6D316FEAEC6793A
26,D95C76946ACCA9D6
27,9893491C31F043D0
28,3688FF86BC378100
29,2FB030D696912BE5
30,3EBA2CD3F372A531
31,1EE69CF61423B432
32,2BAE0D3A6CF25EB8
33,FED5FC9BD7B35D53
34,3015AF669161ADBF
35,5CE3ECA0F9501DAB
36,03411E63565CD911
37,010D8E1BE34538EE
