stop_order,stopId
1,221
2,222
3,224
4,225
5,226
6,227
7,228
8,229
9,230
10,232
11,233
12,234
13,235
14,40
15,236
16,237
17,238
18,239
19,240
20,241
21,242
22,243
23,244
24,245
25,246
26,247
27,248
28,249
29,250
30,251
31,252
32,253
33,254
34,255
35,256
36,257
37,258
38,259
39,260
40,261
41,262
42,263
43,264
44,265
45,56
46,266
47,57
48,2
49,3
50,4
51,5
52,305
