stop_order,stop_id
1,796CAA794D4DEBE8
2,FC42DCBDC3AB0B6F
3,22E2678081E88368
4,7613538D58A9C452
5,9B0382206D441221
6,29A07F043B4D5919
7,87CD68EAD90352E9
8,78AE8E07840D1CF7
9,5146FB43555E8310
10,7297BDBB8A758AD5
11,1D7BC9F560C3B0CC
12,FDA55F46899FC5D0
13,B002CEF0DBC568F5
14,A79D111EB948F013
15,298847E9FCC94FD9
16,86DF43320DF0F596
17,36F2D783428B6307
18,EBA1C02EA9906C96
19,47B8E78BAB4FEB5D
20,0BE9DE9BA299E126
21,4D55F6240E2AAFB8
22,C58FCEE9339E5319
23,1EF5FAB9266BD6C8
24,5D77A5CBE41F2984
25,18F3C20116BFE83D
26,332F374B6CB17C57
27,7ABFD50CAA98A9D1
28,A0FDF34B2D278750
29,53889000AA9C33E2
