stop_order,stop_id
1,D59A5DE108F804DF
2,3E83DFEBD7CBF285
3,90C3A9DB72F244DE
4,6CABA5931F619356
5,7476BFC6F6B5D869
6,F7FB52860229BBAB
7,A6DF150EE61DC8B3
8,65B934D14EA190F1
9,7B98BAE3D93817AC
10,82A8D65E4B7DA67C
11,A9203545EC3AD6EE
12,74381FC9E2AFB379
13,337C68B5F413E04E
14,64E7A52D975DF3FF
15,1F109678B4866926
16,E3825DF066FCABC4
17,2BF5780A30BB85E1
18,C9109584C37A5B98
19,458A5CD02E6008EC
20,E532860B16A18F3C
21,FDC2D737183E7C09
22,B1DE024B06DE2EC7
23,3B487B85E3F07416
24,D6D316FEAEC6793A
