stop_order,stop_id
1,10B8C166D8E60F65
2,951CE3B3EB98BA3A
3,87825C8E4FE99CD8
4,38021D9E2840F8CC
5,942E95B4336BDFA7
6,7B730DF319D6FBA7
7,927CE95D5C98C195
8,7349A9FC61580972
9,B9F5BB33A96E53FF
10,ECD1295E23CF491B
11,8761A61C8F422D4D
12,6D582F3C571E5E9C
13,427116D2E76AFFFD
14,4568080E28FB1E56
15,7F958A00CD28D2AD
16,03134CEBBD692D21
17,914D0783CAF2B89A
18,A780214C3EB5640A
19,DA3DC3BE73A6CF8E
20,50C17CB06B7A0B2B
21,90AC6FE5BBD1428A
22,37A4437BB427891D
23,0E9E4997C2B89CA9
24,55550BED65A18A13
25,38D3C2983AC9D261
26,1B539DE1162FFA1D
27,745DA7ECAF6C9247
28,23B5C67999C778E0
29,F4CE5E8FCC1B2F59
