stop_order,stop_id
1,0B41334D66E94275
2,951CE3B3EB98BA3A
3,5169C5ACEA8B1746
4,2EFDB1EADF5955E6
5,29740CCBBD82FC33
6,7B730DF319D6FBA7
7,927CE95D5C98C195
8,7349A9FC61580972
9,B9F5BB33A96E53FF
10,ECD1295E23CF491B
11,8761A61C8F422D4D
12,6D582F3C571E5E9C
13,427116D2E76AFFFD
14,4568080E28FB1E56
15,DDC689F8C5161065
16,3592A0182BF020C7
17,D49A27F89957E305
18,FC2B17D98106B7DE
19,6F443E11ECDD00FC
20,676FE42A6114CBD0
21,8D916C77F69EAEB6
22,025FCDDC7D93897D
23,3F2DBF48C61352D1
24,252D756034B08C92
25,27A4114521E9F5DB
26,F6D514B8DB0C0393
27,D181B1FCDB28A3CF
28,F4A524D2DE46533E
29,15DFA51C845276FA
30,F75DD3F83B6CFF3F
31,FEA41B63452C8EED
32,5BB9967CA326670E
33,94F7FD9BB4292832
34,8DDA1226E5C7F144
