stop_order,stop_id
1,CF0C67920B22ED62
2,CF94083CB24CF4E5
3,4A76CDB32FA69BC6
4,6F11F73C749338DB
5,98EBAB9468C80DD2
6,6DD6B837EF1FA76C
7,AFD29CB1A4F71AB9
8,60952B4A38F3D82E
9,0E41E02CD9055626
10,EE81A30BE4BDC8AC
11,F129DD8D9E3268FB
12,D0FB28B8EED62431
13,FA52803E2628A212
14,E6022594DB48E35B
15,480DB16994F8FFEE
16,FD8181D7574BB373
17,F1DE119543E382D9
18,A6013462EAC8AA50
19,DAE9E14BA67CEC80
20,3A5C336CCB38A3FA
21,8CE4B83B45F22F1F
22,89F6B64B28A21D34
23,18A85DD43DFA12AF
24,C4B0E899FAE72350
25,8C7C1212A1196A1A
26,996EC6B4E40A2E4A
27,5CA7841E84D52C8A
28,22138E6C8051FDBD
29,17B8C938E2E113D0
