stop_order,stop_id
1,003609
2,003610
3,003319
4,003320
5,002005
6,003109
7,003110
8,003111
9,003112
10,003113
11,003114
12,003115
13,003116
14,003117
15,003118
16,003119
17,003138
18,001258
19,001267
20,001269
21,001287
