stop_order,stop_id
1,002202
2,002203
3,002205
4,002204
5,002262
6,002263
7,002170
8,002172
9,002173
10,002210
11,002211
12,002212
13,002343
14,002383
15,002347
16,001464
17,001522
18,001521
19,001739
20,003233
21,001496
22,001498
23,001500
24,001501
25,001525
26,001472
27,001453
28,001469
29,001526
