stop_order,stop_id
1,7A79D102443D6822
2,60E02B7ACBBB80E8
3,3CF260D7083B411D
4,9458BE33A2B7B934
5,CB4F0A350A26D033
6,1741D103CB826E93
7,4823D6EFB3722E64
8,5089C69E080B7A43
9,1CEB9D13E7279ADA
10,23DC6B90DC9515D9
11,E4C26E79F0D6DC5E
12,0572B9F0B640DB10
13,F93E38FD194A9C6C
14,BE81792B3E788D41
15,E03DE379E28F63D8
16,B563C75938584FDA
17,86DF43320DF0F596
18,36F2D783428B6307
19,EBA1C02EA9906C96
20,47B8E78BAB4FEB5D
21,0BE9DE9BA299E126
22,4D55F6240E2AAFB8
23,C58FCEE9339E5319
24,1EF5FAB9266BD6C8
25,54733D2BB5BE7121
26,D9B53E4B3A192940
27,BC7C325EE59235E4
28,426029D3D8AE6E40
29,9A0959AB68FA5E1F
30,94358F5481BAE505
31,07521BB848913F74
32,0644E10571B8CA12
