stop_order,stop_id
1,001315
2,001367
3,001288
4,001365
5,003251
6,001275
7,001276
8,001277
9,001279
10,001033
11,001034
12,001628
13,001972
14,003614
15,003615
16,003616
17,003617
18,003618
19,003619
20,003620
21,003621
22,003622
23,003623
