stop_order,stop_id
1,EE03BF690B5829A6
2,2431FF3100478DEE
3,ED6FCB0422D541F5
4,330F82C1677EEC3D
5,98FCC750B322B706
6,98735B91CBE6B102
7,EEB8F0A7B9A9AA7D
8,1EC9ED318297A470
9,7ADC6D521E6BECE6
10,E02E10C9135624F9
11,405DE12B9200AD9F
12,145515B1D2C60CAF
13,DBF574C877BF4AC5
