stop_order,stop_id
1,021BA4C3BAC4C747
2,3715F32B3A14C278
3,D35570D44FA8773C
4,43A2973FECD2636D
5,4645CE23D819DEB0
6,E693A3D0BCAF406F
7,23CF721FCA83F54B
8,937CA381A981989F
9,0C8D3ED04A656619
10,FD215BB86EDC1354
11,C4DC1D050CDF793D
12,A6DF150EE61DC8B3
13,65B934D14EA190F1
14,774D2D2447DEA064
15,6239FCEBEDB88082
16,6878FAB7D0006FEF
17,E13E697DA5AE4D59
18,5CCBD9A6B58BF20D
19,E049C81469E2B3C0
20,076E1E9D5874C41D
21,83EB94899B6BBB4B
22,5F60283656DF3016
23,576538E1395C8508
24,9E376227A51AB6BE
