stop_order,stop_id
1,3E2E0FF05B36999C
2,C8811A27E4B64581
3,89ED5D96534CED83
4,5298A15B8CCAEF42
5,A9069A17B1474D76
6,3007D34FB91FB27E
7,255401DABB64289D
8,16CE9E8D17681839
9,A71457854D13E9DE
10,2B9DA1FE14596F2E
11,A07CC0A6D462A579
12,4EE6F43CF8D6217D
13,9541036143D6CCF1
14,1A0BCDF4BDC3E1A9
15,A4EBD881BA65C831
16,05C0C27B083F2C00
17,322A5914FD96DE4B
18,33D2B3AB9D2CCDF3
19,D678B3364437D16B
20,2EF9764BE18FC290
21,5B04604E989BBDF0
22,CCD89A67612BB17B
23,DBEA3F848C7981F2
24,84BACA14B0C50790
25,9C4CA9F8953C0C88
26,921C19F6147C74A6
27,47C3597662B81B47
28,7EF64469471FE344
29,0A03521DFD20FEA9
30,0511A6AC2CBC9A21
31,6E113B962058A553
32,62F953A6FC5652BE
33,ECCCAB1120D6B6C6
