stop_order,stop_id
1,588AC7E77A3E3DB6
2,9E3D2E34F849E298
3,EDE0D474E9C40EC2
4,024D478CE8AC52F3
5,613ED01D077362A9
6,B64A5DCCD5562BA5
7,E34E3D48842C9B66
8,326199D24220A42B
9,C847B9021C407731
10,38330C642568FE3F
11,A15FFC3149FB92A0
12,9DE875FD17C67097
13,68B207DDC9A182AB
14,830588EB9A8D26EC
15,5358062C769CEC05
16,3CE7B5D1EBF9C5F7
17,750ADEB14D018CF7
18,49229D04FCA51B61
19,CED060CB0E89E2B3
20,71B7CB659DF54E28
