stop_order,stop_id
1,95A8334E0385A5E7
2,4173C3AEE8B6F33E
3,AB10F01039440464
4,354A2C15BD189228
5,87668BC629020844
6,645D996BAD54FBBC
7,A68A34F71D94FF13
8,643D73028E9E8490
9,0D7A1D0AECA1D999
10,1D202282C0A82F12
11,D813C93D9AD1C45B
12,7BB395B6FE66E102
13,6D4E7B9D5F9584E7
14,5D9E516680412A3E
15,A264255E81F51111
16,4C86E1F44AE9C25B
17,79C0E2525F4B50FF
