stop_order,stop_id
1,D1167DB184405152
2,0CF8C59B80E70369
3,F05E718C02104BAC
4,0D98A0E934584FD0
5,48FBCEF0B05599F8
6,C296D9B3313C1F77
7,AD4CB5E1CAAF8063
8,723EF8D7809D3ADB
9,591FA32FB4B53682
10,3ECEF3B735084236
11,211D93217331B040
12,E18D73287340B634
13,18B12EFC0F896CF2
14,85CACCFD0C731C5B
15,A77FC2D2F11EC88B
