stop_order,stop_id
1,67D38E584B919815
2,DB11DC6D1BA11F9A
3,876CF2E8C375F78B
4,6386333EDAC64C96
5,6A4B371546D489BF
6,2F8EA7F20F9EC0B2
7,C8FF8B4A87A98184
8,D412D24055680560
9,5169CFB5102E1129
10,C5890150706FE1A0
11,283BB233842FCCEB
12,D0B77FEEE42DB65A
13,B896D9459B2C84FA
14,E53367ABE6927F27
15,3DE45DC85392F3E9
16,6225FE329900326D
17,C187E3771B7032EC
18,41C9CAACDC573B48
19,3B7B4F96BF52237D
20,16C3FC511F2BBC5A
21,0C943B7308FF4DCC
22,73CDC61EBA1C9431
23,D9AB3B959A46E411
24,36DC37F6A54BA5E0
25,65F77C74AB618A8D
26,67D38E584B919815
