stop_order,stop_id
1,ADF5445FF5059D45
2,551DEE0C7120DECD
3,6E1E84A8BAF508AC
4,DB241439B4E2785A
5,378DA3C43904CFF9
6,9FBD2D7974A0AB50
7,1A0BF02F827F6A20
8,6DE63371E5E799BA
9,3CE4F8574F4F9D72
10,3FD481FB9B9DC36C
11,12E4BAFA2B73435B
12,A264A7BA921EEE6E
13,ABE1BADF8D43CB24
14,6A90A40248059768
15,48D55BCE2E97E1DE
16,FBBF4EB577663A13
17,F97A667725CDEB82
18,73FE2D32F218DA9C
19,A264255E81F51111
20,4C86E1F44AE9C25B
21,308112BE50081258
22,537F93CCE45CB56F
23,0AE307AC4840B867
