stop_order,stop_id
1,4442A9A5E7FABAB8
2,EE775A73D626A46E
3,C3D2BF745570F4A5
4,B986375ED4762DA9
5,D417A444017171C6
6,26AC17B8F05DD7F2
7,4A35BB617F75F41D
8,4EB92F34598243DB
9,98EBAB9468C80DD2
10,6DD6B837EF1FA76C
11,AFD29CB1A4F71AB9
12,60952B4A38F3D82E
13,D67917549F3DC8A3
14,EE81A30BE4BDC8AC
15,D2C1454B663392C9
16,30D564180B68ECA8
17,E89B2315750AB2FD
18,4B9D547F0F450784
19,5D1E6432755E4F5F
20,279C78D8C04A83BB
21,BA03816A38B9DA7F
22,D0F8772D043C207E
23,BE36EF30B86ADD1D
24,598F766175BE3EF3
25,5FE12AC5660F89D6
26,144E9479168069DD
27,A88EE1930BE82C54
28,5774E63B634C0B1E
