stop_order,stop_id
1,001249
2,001279
3,001280
4,001364
5,001283
6,001286
7,001214
8,002406
9,002439
10,002440
11,002442
12,002444
13,002446
14,002449
15,001140
16,001041
17,001078
18,001018
19,001019
20,001020
21,001021
22,001011
23,001013
24,001014
25,001012
26,001116
27,001117
28,001115
