stop_order,stop_id
1,002557
2,003414
3,001335
4,001374
5,001215
6,002439
7,002440
8,002404
9,002558
10,002494
11,002495
12,002496
13,002497
14,002498
15,002499
16,002500
17,002501
18,003360
19,001097
20,001103
21,001105
22,001104
23,001099
24,001098
25,001096
