stop_order,stop_id
1,001163
2,001022
3,003407
4,002590
5,001070
6,001183
7,001003
8,001004
9,001005
10,001164
11,001165
12,001166
13,001167
14,001168
15,002384
16,002307
17,002308
18,002309
19,002310
20,002327
21,002311
22,002312
23,002313
24,002314
25,002315
26,002317
27,002680
28,002339
29,002340
30,002342
31,002296
32,002297
33,002372
34,002295
35,002298
36,002299
