stop_order,stop_id
1,2255A14989E8F149
2,C000E4384A704993
3,C8FD960431F7210C
4,177E7222D0968DE5
5,015AD27DAC83E698
6,83BB162ED5F1355F
7,7380707A36C032B9
8,60D0B9706B352D1C
9,CC811B604DD883AE
10,8570495BD7C63C02
11,427A1FF65094D4D0
12,317BECDAF11EB461
13,D1AAD1771F3FA9A0
14,D625B0997C3DBCFE
15,C5F7AF8D65B268E4
16,A90CDCBFC07EDF86
17,84ECCB274C4677E8
18,7310528ACFCE20DF
19,EAAAF871D43F7B6F
20,EB471522ACF7B803
21,EF71BF522855A38A
