stop_order,stop_id
1,4E42234F86ABC6E3
2,6085C420AB7E6FF9
3,195090E551109C0A
4,4624AC39DB25D456
5,2DB47A3C263E4F5C
6,6DFEED7F0DB44298
7,A6ACEA5D8F32521D
8,30FEA8A7071EDE48
9,69C45315DFA906FC
10,242DFDBDBFA2034A
11,E05F8589B0529DE3
12,946657B831E4AAB8
13,BA2F4E8CB1D43CD8
14,04FC6E130D4953F4
15,B294A8638290F5C2
16,70349D91EC82AFE1
17,E35B5F1B80E085E6
18,A3F6D2CA9135A988
19,375D37F2AF5D762A
20,37A4D07D7179CE76
21,C979915CB2F4A35C
22,94612276CB142F93
23,24BB2F5E5721E970
24,0E7645CCF6AA3558
25,DB91BE349DC15226
26,044D07048F45F915
27,6E6EBC9D1AF2DA52
28,68758E936DF9B173
29,EC14900F4BD3744B
30,D2EA32ACC919A9EA
