stop_order,stop_id
1,43531EDD45A4B0C1
2,5D6FB6C3F67A70DC
3,5734545592215022
4,3FD481FB9B9DC36C
5,12E4BAFA2B73435B
6,30D564180B68ECA8
7,9A0959AB68FA5E1F
8,81C6D8E74259157E
9,5D8FCEF2915882FD
10,C2605DED84199B84
11,BF8E440F5584D39D
12,8D0555A78A132018
