stop_order,stop_id
1,003369
2,003505
3,001576
4,001577
5,003522
6,003012
7,003013
8,003690
9,003691
10,002835
11,003692
12,001559
13,001561
14,001565
15,001567
16,002811
17,001482
18,001400
19,001403
20,001401
21,001402
22,002630
23,003549
