stop_order,stop_id
1,001368
2,001239
3,001240
4,001241
5,001242
6,001211
7,001250
8,001208
9,001209
10,001210
11,001324
12,001388
13,001325
14,001326
15,001327
16,001247
17,001261
18,001262
19,001310
20,001249
