stop_order,stop_id
1,EA01416B0BB7E485
2,2CC694E5A84B05A0
3,43531EDD45A4B0C1
4,1A0BF02F827F6A20
5,9FDEEC09AD1B601B
6,2A86FE3FCDB9760B
7,5FCD0D727920EC65
8,4253205251F0AB8A
9,E32D979C93E923E4
10,53B170EAFEADDF86
11,42C72FE60B928D1B
12,1C213636264467BB
13,E7B5458F607C3F6A
14,6C5D425EDEE7498A
15,B97CC3668C3AD911
16,0F3FA9B7D07A91F3
17,C837C3C549793472
18,2AC85D87661D5AF6
19,53BB93AAB2D45F3B
20,1380D71251D0CBF9
21,EDFAC4F35C0E51C7
22,FEC59562CBC99F5E
23,650809D260BC7C6E
24,F81DACC5F39E6D53
25,D417A444017171C6
26,D876A83244ECB838
