stop_order,stop_id
1,F0A8A596641FFC5A
2,19521C0A1CA93C52
3,6FA31E38468068B6
4,A7AFBCA40D458E0D
5,CAE09A3D7E2BE997
6,4E366AF78461E12D
7,AD0E19B05666A22B
8,C7C1C12D89968698
9,E34E3D48842C9B66
10,2431FF3100478DEE
11,ED6FCB0422D541F5
12,850F72123F644500
13,3821D64D2BF1BB66
14,66C6FDFC88F56E51
15,7CD8F96A087CDDF2
16,6DD60A482B4CDAF6
17,922B809184ED33A9
18,719B6A48C203AFBA
19,56D43C634272F125
20,4BF5A563B95D2F42
21,5D26737FDFC4F738
22,3147FEC6D6DC535A
23,43F5D5E06711C646
24,86A5437DDF01EDE1
25,D9185868BC7E2D84
26,8FA45700BDAE662B
27,3E6118D2AD8D9330
28,6ADCBDE3DD43F8E7
29,5C6A29BCDA410664
30,939DD40498CB3066
