stop_order,stop_id
1,001177
2,001183
3,001003
4,001004
5,001005
6,001164
7,001165
8,001166
9,001167
10,001168
11,002384
12,002307
13,002308
14,002309
15,002310
16,002327
17,002311
18,002312
19,002313
20,002314
21,002315
22,002317
23,002318
24,002260
25,003287
26,002157
27,002158
28,002159
29,002344
30,002383
31,002399
32,002371
