stop_order,stop_id
1,DFC270E9F05B557E
2,D813C93D9AD1C45B
3,7BB395B6FE66E102
4,B10F5697E4DA810B
5,67D80F37744E1277
6,080EF1BEA737A5D3
7,AFB9321F7CD2C2E4
8,7898B605E39613A8
9,CB853E4BCBB13F30
10,A12E1F37C7D98567
11,3ECEF3B735084236
12,211D93217331B040
13,D198122830A4FDE3
14,99EF4CA10B3E1F17
15,326199D24220A42B
16,C847B9021C407731
17,38330C642568FE3F
18,96A6FE5F07BDF203
19,5D1E6432755E4F5F
20,EDDE9311F49AC296
21,D9B53E4B3A192940
22,BC7C325EE59235E4
23,9E256D7EE9FE68BC
24,DF942A6B97EABDC4
25,CF579AAA2A4E506C
26,80B56E2C7719DAF4
27,71E3EB7E709522C7
28,7188D2451C5AF461
