stop_order,stop_id
1,64FC3B939BC09903
2,257FC0FE0C3407BD
3,1795DD6257DCDF2D
4,7D294B212DE45BAB
5,76D5D1574C19E1CF
6,CE16398D20C49547
7,04A1C2CF16402056
8,889783C98226115D
9,F49967C20E98FCAD
10,D6B980F49564F59F
11,1BE6E262F7DDBD53
12,59899C91FD8A9C2F
13,9585FB90C56F451F
14,4EA9AA1416D2A374
15,B307B119B43E1898
16,123AAC5B4BD9CD9B
17,8474FF2FADBE1F8D
18,101F5C624494D3F8
19,4D00EFD59AF12315
20,CD5DC8318C78D8E5
21,B481881866A59462
22,D0236013EDCA9EB1
23,6B1E8CDB2F6258EF
24,5C1FB04FF191337B
25,0021EF45E20547CA
26,956302DA435ADE07
27,5670D4C081B08DC6
28,78644FF7E8B7BBA0
29,0221966C1116C4EC
30,3465CA4854929709
31,C552CE565E1F0C85
32,21466046C6868AA7
