stop_order,stop_id
1,002974
2,001291
3,002533
4,002534
5,002465
6,001213
7,001259
8,001260
9,001261
10,001262
11,001373
12,001264
13,001265
14,001266
15,001267
16,001268
17,001269
18,001287
19,001296
20,001297
21,001298
22,001299
23,001216
24,001217
25,001218
26,001219
27,001220
28,002778
29,002582
30,002771
31,002772
32,001339
33,001340
34,002773
35,002775
36,002774
37,002585
