stop_order,stop_id
1,0CB1F7979192FBB2
2,8337F935242C5CC3
3,0D4E07F475845DB3
4,B071B60F5566934B
5,7333653B0F4B71BD
6,5ED989C30DF49DE4
7,1D6A8B8C58C268FF
8,95C538941C437656
9,3114213F8975F536
10,D1AAD1771F3FA9A0
11,C80FB453C9F53569
12,2A01E3163DF9A954
13,F6E296480D3481A2
14,25455FDE268CF605
15,C1AFF00AC64F457A
16,5396072459507B7F
17,C048D4CF6ED36C7A
18,68A8F08ABC5C90F0
19,91929D42214F3D7F
20,97B7EC0354E020B7
21,ED03E689B88CE0E8
22,B122FA4A77BABF24
23,B452F1514B4FEE40
