stop_order,stop_id
1,29F7954D216356E1
2,1FEA0FF1E4CB57E8
3,95067FE712E8ACEA
4,20709808D79F1BB9
5,E81E4649EB1D5B02
6,23362ED34834C5F0
7,38BDB19C8D7B8DF8
8,319CA16456A9010D
9,7F445DD11BE9B105
10,F6E296480D3481A2
11,25455FDE268CF605
12,C1AFF00AC64F457A
13,5396072459507B7F
14,D46ED62A04D37ECE
15,68A8F08ABC5C90F0
16,91929D42214F3D7F
17,906508C26C6B89EC
18,8D5FB973BE9429B4
19,AD803E8A0ED6C3B9
20,98F5ACF0CF540E7C
21,505D36136FD57784
22,FE2815CBCD21C57C
23,BEEBDDB542A7E709
24,48184733EFE9D3E3
25,8E8DB91C885F1230
26,DCFF4041D0C0ACF8
