stop_order,stop_id
1,EFA7876734213321
2,6A4B371546D489BF
3,CCBBE2779B1765C4
4,78AD2432201EF5EE
5,D9CE618F99BAC2B6
6,1B0FD9C27F5FE0BE
7,A010FE2C473103A8
8,A264A7BA921EEE6E
9,ABE1BADF8D43CB24
10,6A90A40248059768
11,48D55BCE2E97E1DE
12,FBBF4EB577663A13
13,F97A667725CDEB82
14,63DF37D89C356A04
15,FE801C732EC6EA42
16,6D4E7B9D5F9584E7
17,5D9E516680412A3E
18,A264255E81F51111
19,4C86E1F44AE9C25B
20,308112BE50081258
21,537F93CCE45CB56F
22,0AE307AC4840B867
