stop_order,stop_id
1,D27B34CA3854232D
2,3E63535258CAA9BB
3,11B2034DDF30617A
4,D17DA49D5EFC6DD4
5,140E4137EAC319B5
6,2658CCFAB79763B6
7,264B29FD223D9C4E
8,3E376000C84807D6
9,C84CAD6CCD18F87F
10,A13C2C1D5D3EE0D7
11,AE7C79C814E6BD95
12,D5382A8A3773E6FE
13,FCBCC90E0ECE4F58
14,257A6E19DD7F156C
15,28A57C043C111604
16,F82CDE4D15A43CA3
17,DEDD6247441C8C05
18,3B54D43994CAC165
19,D9655458715EBBF8
20,8374DD78C287D9A7
21,D5252DAD51812506
22,09DF70F8DE2426BE
23,7019D5AE9C63EE72
24,4E224310C4B46C9A
25,3F545756160D7BEA
26,BFA3460955AC820C
27,5FB1FCAF80F3D97D
28,FF4785270078B487
29,90A65F742FE7D728
