stop_order,stop_id
1,003340
2,003416
3,003342
4,001969
5,003277
6,003417
7,003418
8,001980
9,001981
10,002056
11,001983
12,001984
13,001919
14,001920
15,001629
16,003253
17,001028
18,001029
19,001030
20,001137
21,002430
22,002432
23,002435
24,002437
25,002555
26,002535
27,002536
