stop_order,stop_id
1,003246
2,003247
3,003248
4,003249
5,003250
6,002021
7,003227
8,002025
9,001986
10,001463
11,001315
12,001304
13,001288
14,001271
15,001272
16,001273
17,001274
18,001275
19,001276
20,001278
21,001281
22,001283
23,001286
24,001363
