stop_order,stop_id
1,003415
2,002445
3,002447
4,001140
5,001142
6,001055
7,001057
8,001058
9,001193
10,001628
11,003359
12,003153
13,003192
14,003431
15,003351
16,003209
17,003760
18,003767
19,003752
20,003753
21,003760
