stop_order,stop_id
1,9D80403C90EDFBAD
2,EE5D9C9A5622C786
3,AC48794DF1F3332C
4,61C5F8F2F38B2BE3
5,B9CC4872480304AA
6,E80A3E968CCEEFF7
7,4960882151DB05E0
8,590E23621FD23B6C
9,F4B357B11344180D
10,5C6534DD562AEF61
11,7DF81D14A8CE574E
12,3FB80081AB2FF6FB
13,448C1B8AECA89A6E
14,661FEE32A0D73EB0
15,2196A42A8F733DB5
16,E7A17EFD6E7435AF
17,49FAC55AF9CB8272
18,87825C8E4FE99CD8
19,5CD4C77378D3A4AE
20,942E95B4336BDFA7
21,33BA3785390F1457
22,177A516A81E9DEA5
