stop_order,stop_id
1,001757
2,001701
3,001712
4,001702
5,001703
6,001704
7,001705
8,001706
9,001470
10,001796
11,001450
12,001451
13,001577
14,001530
15,001814
16,001538
17,001539
18,001414
19,001415
20,001631
21,001477
22,001596
23,001769
24,001547
25,001549
26,001551
27,001553
28,001396
29,001423
30,001707
31,001853
32,001832
33,001833
34,001834
35,001836
36,001845
37,001866
38,001867
39,001872
40,001838
41,001842
42,001862
43,001858
44,001860
