stop_order,stop_id
1,689BAEAC4F89EC8B
2,41F70B064C26F180
3,90535913F657C516
4,30EEA6AE38D033E9
5,98D50686DF57B6F7
6,EC839AE65935149B
7,5BF8B3896F3E8F0A
8,A822D5DE44F24B7B
9,AE4E8F82AD65348C
10,225E8FAE869B3308
11,4A626ACD36F8ED7A
12,11B2034DDF30617A
13,AA97FFC49AE957A5
14,F6A446C66F7F805E
15,35CD2E3911AEA038
16,C847FC07707BC068
17,AA62C03711F778F2
18,47B6BE5FC95C2042
19,BB172B3A5DAC85A4
20,D7A05B5BAF07A89B
21,A1C65E46464147A0
22,75957EA713E84A37
23,D0B8C96BC4451180
24,B68FB7076BB07A22
25,553D370FA21F7DA4
26,72999453ECAC4693
27,AA26D9F25826AA4A
28,FBE38593BDEB0802
29,9A0959AB68FA5E1F
30,06834C0C275F4DDC
