stop_order,stop_id
1,003566
2,003568
3,002589
4,001873
5,001876
6,001878
7,001880
8,001882
9,003443
10,001854
11,001629
12,001028
13,001046
14,001051
15,001136
16,002430
17,002432
18,002434
19,002435
20,002437
21,002713
22,001213
23,001363
