stop_order,stop_id
1,969973D9D60AA02B
2,EDF4C2EAFDBD4693
3,5AB4B6D054B4B8D3
4,2FD7EBBD4AF78A93
5,CBBF3CAABD86AC14
6,C2787E27F82716BF
7,854BC3A8D4DE6AA9
8,09A156B1A802D093
9,BD34A7B702373B12
10,E30C2815DA280036
11,C06334CA2AF7814B
12,E5EBA1D47BA06FCC
13,18C138014DF5B0C8
14,0FDE3A87457539BC
15,4459E386C8525C34
16,87CA6EFD0FFAF72A
