stop_order,stopId
1,270
2,271
3,43
4,234
5,235
6,236
7,237
8,238
9,239
10,240
11,241
12,242
13,243
14,244
15,245
16,246
17,247
18,248
19,249
20,250
21,251
22,252
23,253
24,254
25,255
26,256
27,257
28,258
29,259
30,260
31,261
32,262
33,263
34,264
35,265
36,56
37,266
38,57
39,305
