stop_order,stop_id
1,CBCE32D56C5263A9
2,5D7715C4BFFC9979
3,2BEAF37792BFDCCA
4,E01BD8E1BEC29EA6
5,229128E5EA86F3A2
6,776535DC784DD106
7,0482E6668E3937DF
8,FA36E29F8BCC544C
9,448D42252303EC00
10,712504F8E762020C
11,F307FDA96A1DF9A2
12,8E76875D12C239A3
13,ADE15F24D2EE0B20
14,9E10C87488BC7493
15,951EB88600BAF893
16,F4C9995BB455AB46
17,D74B67D55C63895F
18,249DF4A1B287E14F
19,AF9FE138E3D5D5F0
20,1D44677AEFBA8773
21,18580F35B0A312CF
22,40ADE0A2BB16271A
23,333A88A8E07C956B
24,B2442AC56532517B
25,78644FF7E8B7BBA0
26,0221966C1116C4EC
27,C70342BF7C6A4732
28,0D5759F7A4B185FE
29,C552CE565E1F0C85
30,AAC64BCDD5B55A86
