stop_order,stop_id
1,F75D0D2C6014A854
2,8A573E6526B8EF88
3,1D53F0BB47AB8441
4,AD97EA183A25102C
5,643D73028E9E8490
6,52241C2AEB38627B
7,14157BA5C06B0B6B
8,AC935792C88AF135
9,43E5D3A445382F82
10,DAFFF59B0718B464
11,6723518D536070AB
12,FF39B95C2931B8A1
13,E5CD4F98F31F239C
14,D1167DB184405152
