stop_order,stop_id
1,0D9932C476D51576
2,E70EDF92FE8553E2
3,FAAD25334A972923
4,42AF8D1ADA2FA6C0
5,C9A46DDC082BAEE0
6,BBDFF2D05E37EE61
7,266A4CDA19461A42
8,31852497A98F4A15
9,26A996F589C84844
10,F374B56E275194D8
11,AD0B5EFA2471962C
12,9274EF6791CA3ED8
13,739A5DDE0CF1970C
14,9E95343C77BB85E2
15,2D1A8946EF054FC9
16,DADEC4FDAD7C58B3
17,E8F5E085BAEFE100
18,79FD1B44D37205B8
19,369A5601F8A63B5E
20,A339426A8F633D63
21,CDB292D507E4302D
22,C55F50E43F6108EB
23,FDDA176977136CD9
24,A3A7B2B94458A263
25,9FDEEC09AD1B601B
26,2A86FE3FCDB9760B
27,5FCD0D727920EC65
28,4253205251F0AB8A
29,E32D979C93E923E4
30,53B170EAFEADDF86
31,42C72FE60B928D1B
32,1C213636264467BB
33,E7B5458F607C3F6A
