stop_order,stop_id
1,001519
2,001521
3,001494
4,001495
5,001496
6,001498
7,001499
8,001500
9,001501
10,001502
11,001575
12,001576
13,001577
14,001530
15,001814
16,001538
17,001539
18,001414
19,001415
20,001480
21,001481
22,001482
23,001586
24,001853
25,001844
26,002714
27,003550
28,001837
