stop_order,stop_id
1,5316ACA3C23FE1A1
2,3CB45560769AA11A
3,434BB67EF7BCA912
4,698AD748223B2BEA
5,9BEBB2D3B05DD529
6,849062B1454057E3
7,BEAAE3DA63C543BD
8,FD3E79D1B5A2237F
9,FFB21D12A61560FE
10,F3CDDD199E10AD91
11,A7E87E8D797D1A52
12,6825AAECA55E0B01
13,353B45E1D051707D
14,9CFF3C233ADB8D19
15,5D706A2A71B26811
16,132584D5CB2235BC
17,D992534B2A407C74
18,033CB7A21D6DC60C
19,7C16C33063484D0E
20,93F4EA3D82B33BEF
21,3DD784D9B2C30AFC
22,939FE9A08B99174C
23,50C0A622B149C308
24,A73739F6D37090EE
25,07814531B88CD829
26,A722DAAC99CE03D4
27,5FD70A34C55CE590
28,A6DCDE5BE439B179
