stop_order,stop_id
1,CD3092383ACEF208
2,500EB63FD4A41F66
3,D024B008AB77435B
4,5309D748976029CB
5,3C6DAB7267F9E54F
6,73E85E88E124EF2C
7,6C6B36F7550907CE
8,25F3EF8ACD865DFB
9,478A61BE44E34707
10,9E1F0E5A57F3D3D5
11,4B17C55C032D3A37
12,52AE04E9C3E77BE1
13,6BB5645D03BE78E7
14,DCC8F8655EB76754
15,AA6F0A2661759A49
16,52A8DA8958AFCCA6
17,0EAFBD8737911A6A
18,E435F72ACB8438ED
19,60A445D9ACD40C12
20,118450CCC68E42C6
21,6AAC8E541D9BD80C
22,0269A1F9D98C737E
23,A8B22902BD665766
24,320704B87EF998D4
25,7CFE29DD74F71B2F
26,667E322246C6F7FA
27,015AD88813C61900
28,B88E6F52E2BC2E34
29,3FAE59A79C8BCC93
30,F18230D9F2792E77
