stop_order,stop_id
1,3F9AE21DC3A540B9
2,5FD7848A339751B6
3,9689432947997FE9
4,2A5B424322D35B0A
5,ED8812E232F6958A
6,62F395D60229C8F5
7,1FBAAE29AF1CA50E
8,03C3F537C41E4986
9,2FFC93C766E566B5
10,F5A61D37E2DDA9D8
11,31079A9B244C679B
12,ABC15E2110BF7A49
13,BC66863007C0592B
14,848CA90EB0DB1146
15,7486D53F341F1AAC
16,C73A03D6C468B767
17,22E2678081E88368
18,7613538D58A9C452
19,336FF66D1F0AC4A0
20,7E5A9F7D64C12E4C
21,99A3DFDBDF41F0E9
22,92BC52AEBC658E49
