stop_order,stop_id
1,001250
2,001208
3,001234
4,001235
5,001236
6,001237
7,001348
8,001349
9,001290
10,001291
11,002533
12,002534
13,002465
14,002439
15,002440
16,002442
17,002444
18,002446
19,002449
20,001140
21,001041
22,001078
23,001018
24,001019
25,001020
26,001021
27,001011
28,001013
29,001092
30,001091
31,001146
32,001148
33,001149
