stop_order,stop_id
1,69741C71C234C871
2,9B761917E5D9A80D
3,26CEAEF7BD0F6F59
4,48E68D36FFC315F6
5,1F3E9C9CC6FC869A
6,6458484907C76A06
7,E697B8AFFADE6E21
8,4D0C5F20055CA652
9,BFD37036CFD5FCA1
10,24D77D8722934A82
11,A568A1F7953CDB7C
12,8967776AA0DF7E29
13,C12CB15E0CE109FF
14,4C0E31FF4D276D4D
15,5291C2473CB76D81
16,1E459B2BE44AF232
17,4E237FEC65B2FF28
18,E2733C6EFAF398B8
19,4C19E0623146E4F9
20,CCC5BAA6257BBDAA
21,D9111A160E3787AB
22,437D60C455A624E6
23,A23337DAF4A8B168
24,CC70125C02A60585
25,C06FB5A6B411531F
26,E83A9BC796627F57
27,D10D7250FE345946
28,A44D983C2E3C7F1D
29,DF3F6652DC307265
30,D4136D223D5EFF10
31,57E8535707AE3EEB
32,B05D756C845FA4D4
33,84FB4D7D386169D7
34,7A8EFDDC5E341FCD
35,193F348597404EFC
36,D03560F5A7014BB3
37,C97621D676C9EFE6
38,D9E7FBC3599B5EE0
39,CDB292D507E4302D
40,C55F50E43F6108EB
41,6716018C3EE42733
42,1A0BF02F827F6A20
43,18E4449F4C5CE30B
44,C65C38558F2F978B
