stop_order,stop_id
1,002536
2,002554
3,002440
4,002443
5,002445
6,002459
7,001074
8,001033
9,001034
10,001057
11,001193
12,001628
13,001972
14,002620
15,001988
16,002076
17,002650
18,002623
19,002077
20,002669
21,003481
22,002062
23,002666
