stop_order,stop_id
1,002186
2,002187
3,002227
4,002228
5,002229
6,002230
7,002231
8,002232
9,001109
10,001110
11,001111
12,001112
13,001113
14,001028
15,001029
16,001030
17,001031
18,001138
19,002427
20,002451
21,002538
22,002540
23,002470
24,002348
25,002355
26,002357
27,002358
28,002160
29,002161
30,002162
31,002163
32,002261
33,002226
34,002183
35,002184
