stop_order,stop_id
1,2973FA26FC035FE7
2,A5B328EAF882C44B
3,4A84482F3A54E4CC
4,70A7D4C9EDA6D50A
5,EA2CFF27310EAEC3
6,3C0AF6BA82588E2F
7,F8DEE1D5F9A349AD
8,6765DD696FA8BF8D
9,DD5B5646768C5F09
10,6CF34EF02CDBE26B
11,073C44CE5FF431BC
12,45C2286729E1475B
13,00A529823BEBABA7
