stop_order,stop_id
1,5FA8B50329B85F1A
2,53C49B85EBFF8AAE
3,74648B92E0E80E2E
4,4DD5EC5516B360D7
5,33ABA49F0E91A247
6,B34F59A0270AEDA4
7,B644204AEDE7A031
8,5C2A974134634635
9,A0D379E172F5BC93
10,853CD1316EB5227B
11,BE6EC9708F5FB613
12,620E14F31DA31490
13,09B4297CB90AF3EC
14,97BB9CE7A058E809
15,9FD6AAFA1318E3D9
16,03A5552B84E8214B
17,0B4807A5C0DAF24A
18,40A8EA2850B0979B
19,B943DBEE65B0B18F
20,7019D5AE9C63EE72
21,01642BC44DCFDB3C
22,E0908A8C2459FA0F
