stop_order,stop_id
1,001027
2,001044
3,002737
4,001051
5,001137
6,002427
7,002431
8,002413
9,002539
10,002968
11,001475
12,001412
13,001413
14,001534
15,001535
16,001772
17,002991
18,003005
19,001689
20,001452
21,001448
22,001503
23,003605
24,003606
25,003607
26,003289
