stop_order,stop_id
1,E5138E0C4EC43596
2,B896D9459B2C84FA
3,E53367ABE6927F27
4,3DE45DC85392F3E9
5,6225FE329900326D
6,C187E3771B7032EC
7,41C9CAACDC573B48
8,3ECEF3B735084236
9,211D93217331B040
10,466111DE1A3E4656
11,8D845BED93F1CDD3
12,25D811895B82ABCA
13,709C8604AFB90F27
14,8379C4B1265C27F7
15,C804CCACB2781EEE
16,AD1B202B678A3B56
17,C88DEC0AF0D1102B
18,4C333C4D4E80902B
19,F1A22B170518051B
20,7F0D726107B2540E
21,17B98BD1165A7B92
22,186754E04899194F
