stop_order,stop_id
1,003345
2,003346
3,003092
4,001950
5,003093
6,001914
7,001915
8,001986
9,001463
10,001265
11,001266
12,001267
13,001268
14,001393
15,001270
16,001296
17,001297
18,001298
19,001299
20,001216
21,001217
22,001218
23,001219
24,001220
25,001221
26,001222
27,001224
28,001225
29,002591
