stop_order,stop_id
1,939DD40498CB3066
2,66A93A407AB08486
3,38AD2E7846D11D52
4,6F1AFEEFEAD811A4
5,90535913F657C516
6,F6E414A440CD7C70
7,718556B5D930CAFB
8,98D50686DF57B6F7
9,EC839AE65935149B
10,54693CF35B03CC69
11,AE4E8F82AD65348C
12,3E5A3CFA10D8D300
13,225E8FAE869B3308
14,1B1A7253CC1D3148
15,86B81946F9FA57FB
16,A07CC0A6D462A579
17,9E25CF3DAA0BA0C4
18,9541036143D6CCF1
19,13C75FFFA2BB060D
20,78277EF9D0189DED
21,79AFB35F9DBD485A
22,D5DB45916FCE114A
23,5D94D3084F0C3831
24,89A4D25AC31A8388
25,6465986EF7824816
26,C53A00F15DC2DB20
27,48E5A1EED91712EE
28,D099C45C9443AFC8
29,45D0CFA28B3FEFE5
30,B8E2647E9C5019C9
31,AAECA769A84E2372
32,A66159E033DDEA04
33,C92E80A5D7E0E8EC
34,07ADFF84F3502690
35,3F6F5DC1DDA5F68E
36,45809C20B6578E53
37,6953AEF8B3921959
38,56AFC1C9335FCF1D
