stop_order,stop_id
1,94780B40412261CE
2,31317843D8BA833F
3,C185612B431B197A
4,A4C9136D18013389
5,63E6DD5119A301AD
6,EF01999C9F909553
7,CF89BD775D2ABDC9
8,711A39D02DB2B4D8
9,64CE8117895E8FAD
10,5CD4C77378D3A4AE
11,942E95B4336BDFA7
12,33BA3785390F1457
13,6D1FFB57C26F1108
