stop_order,stop_id
1,002918
2,001826
3,003471
4,003472
5,003474
6,002917
7,001821
8,003329
9,002919
10,002928
11,002929
12,002930
13,002931
14,003589
15,003590
16,003591
17,003575
18,003576
19,001649
20,001607
21,003710
22,001695
23,003711
24,003284
25,003712
26,003713
