stop_order,stop_id
1,1E5EADCD9F424F07
2,CB2BC86A32D7C830
3,1F2E60EDB4254D30
4,EA4A3876639F21B4
5,B0F64FFFBECE8AA4
6,5EEFE2E2583B576B
7,1E0C8A961881DE1D
8,38F0C9768AA2AF93
9,30FEA8A7071EDE48
10,3CE4A2049409A6DD
11,E6ED785726AED4AE
12,E9F3DC5D89154BB7
13,1A85B99EDE6D01D8
14,04FC6E130D4953F4
15,D355B700FF30B3D7
16,1F51B830DD359962
17,91C7F46612ADD9EF
18,9B664F8FD4E76E48
19,20E8B4520A802912
20,4E224310C4B46C9A
21,3F545756160D7BEA
22,BFA3460955AC820C
23,5FB1FCAF80F3D97D
24,FF4785270078B487
25,9386CDB16D533E27
