stop_order,stop_id
1,002923
2,002924
3,002925
4,002926
5,002927
6,002928
7,002929
8,003329
9,001769
10,003152
11,001549
12,001553
13,001396
14,001423
15,001517
16,001436
17,001437
18,003228
19,002882
