stop_order,stop_id
1,002003
2,002062
3,002621
4,002075
5,002622
6,002667
7,001989
8,001996
9,001991
10,001992
11,001998
12,002001
13,002153
14,003643
15,003644
16,003645
17,003646
18,003647
19,003648
20,003649
21,003650
22,003651
23,003652
24,003653
25,003654
26,003655
27,003656
28,003193
29,003657
30,003658
31,003358
32,001629
33,001028
34,001046
35,001047
36,001051
37,001052
38,001137
39,002427
40,002432
41,002435
42,002437
43,002574
44,002535
45,002536
