stop_order,stop_id
1,44AF4BBD0B0BB3A0
2,FC29C8A636233BB4
3,277172A410622365
4,173B80CC8B075A71
5,45AA6AF583A32F40
6,229C618DE131245A
7,90C3A9DB72F244DE
8,81631C6B0F2D1843
9,7476BFC6F6B5D869
10,F7FB52860229BBAB
11,6045969736940272
12,F851B0B122F38CCC
13,2FA93329F924968F
14,1E58DF8CAD59712E
15,12B08A64756B780B
16,E99D3F96A9F7B5EB
17,661FEE32A0D73EB0
18,51831905D7BC1802
19,E7A17EFD6E7435AF
20,DFAA3371878CEED2
21,D80313EC29620E1D
22,BA03816A38B9DA7F
23,4BD5CE5106BB0697
24,6465DE9EE57F6C94
25,3E73B73B12E25DCF
26,0B8C52E4C34E3B64
27,144E9479168069DD
28,7459D3AB11AFD6B5
29,3CB982FBC9E50AAA
30,F49FA120DE5E6582
31,1EF0671DB830C59D
32,3144CE950CE29C80
33,543FD8B6C65D1C4C
34,316BB2C947568585
35,3E862B92873F5811
36,57A0D4D6D4D57497
37,C33442BEF9C1B280
38,19171A194D7507D5
39,E4E008D61686FB33
