stop_order,stop_id
1,001177
2,002764
3,001059
4,001060
5,001192
6,002734
7,001064
8,001065
9,001044
10,001047
11,001051
12,002479
13,002480
14,002481
15,002482
16,002484
17,002405
18,001475
19,001578
20,001579
21,001616
22,001617
23,003015
24,003016
25,003017
26,003018
27,003019
28,003020
29,003021
30,003022
31,003023
32,003024
33,003025
34,002993
35,001689
36,001452
37,001742
38,001698
