stop_order,stop_id
1,001382
2,001386
3,001312
4,001226
5,001227
6,001228
7,001339
8,001340
9,001341
10,001387
11,001229
12,001230
13,001231
14,001232
15,001233
16,002414
17,001475
18,001769
19,001547
20,001549
21,001552
22,001774
23,001516
24,001630
25,001693
26,001694
27,001638
28,001639
29,002593
30,002882
31,002594
