stop_order,stop_id
1,001145
2,001144
3,001032
4,001035
5,001124
6,001126
7,001127
8,001134
9,001135
10,001130
11,001131
12,001119
13,001116
14,001117
15,001120
16,001118
17,002234
18,002236
19,002237
20,002238
21,002239
22,002240
23,002188
24,002189
25,002190
26,002233
27,002260
28,002388
29,002157
30,002164
31,002165
32,002365
33,002366
34,002367
35,002368
36,002369
