stop_order,stop_id
1,8890B5BA8EC088D9
2,CB2A65E69B2B71BE
3,F0536729876AA9D0
4,1E15CFA82F408124
5,01F91A12857E4531
6,630AA1866C5372B6
7,A2586669ADE21A28
8,C90375A74B02D2E8
9,EEC48EC880FC63CB
10,242418A9AB386596
11,A9D85812EAEE6C17
12,971554761E4413EF
13,7FB2AE7FA13EDB0F
14,4F64DA53415F3128
15,BF7FD3BC4994EBE5
16,9DC117C78DBDB1A7
17,BD52FF1BA0AC99BE
18,1F2376A52800A2CA
19,0B72FFAB7F7230E4
20,9955DA9311A76BA4
21,0CF05B00D82FECB2
22,10860B611840CF22
23,D6C06E7091666AB4
24,F8D8D0AED9889278
25,2D33D39F61B74C5D
26,AAB411C52D067AD1
27,558D298696B57A4D
28,B09E06FF6EF5A8C4
29,4E3FEA4E559A5D16
30,DA17B01A4A61A358
31,3E8426FA1832BA50
32,7420DF52F1B42C9F
33,7467287ACB876529
34,941B58A78A49CD0B
