stop_order,stop_id
1,430B9D9C6AFF364D
2,EF5A5CD9C3A038C9
3,A5E27C280260D008
4,B9343464EDE68947
5,8A25BDD80CA7201C
6,C9051FC04690CD7F
7,1D093403B1F24DF7
8,9C1D2401E1E06544
9,4BD5CE5106BB0697
10,6465DE9EE57F6C94
11,3E73B73B12E25DCF
12,5C6F557AA652B05C
13,38B86AC474D1060D
14,0B8C52E4C34E3B64
15,144E9479168069DD
16,F36C1B3AC57D96FA
17,B1B0E08245C0FC15
18,2E2AD8BFE00F9FAB
19,3CB982FBC9E50AAA
20,F85916921D80C45A
21,1EF0671DB830C59D
22,3144CE950CE29C80
23,543FD8B6C65D1C4C
24,316BB2C947568585
25,3E862B92873F5811
26,57A0D4D6D4D57497
27,215D99B3E2A5F8DD
