stop_order,stop_id
1,0718DE53C1C84496
2,06834C0C275F4DDC
3,07521BB848913F74
4,C32B9494869D5BBF
5,3F9AE21DC3A540B9
6,F2127FD781019971
7,E121F366E450943D
8,5AAC6A858427D04E
9,5BDD5F9F4C89D3E1
10,9535298A652873DB
11,A1D5C0FDCC39AFF8
12,72F07CA66230A1BE
13,C19CD7CCA03DBEBA
14,EC157EA93B3DD279
15,FACE7DC841CEF78F
16,41E537666558ED07
17,687325CD84BA96A0
18,B83A88488B3F6EAB
19,D533E8F25C189485
20,0F421E6B729C2D24
21,981A7F2220E8B3CA
22,2E0D7F52D1608C12
23,3F06E3B155C6A4BF
