stop_order,stop_id
1,6C5D3C3EEFF28EE6
2,8C8191357A7B2C2F
3,5C572C50B1AA2B95
4,D1C91ADAA2E0E466
5,725496526DF766B9
6,3AC7A0BCF72D7F54
7,04EA3349BDD260C8
8,6ACFA599CC0EA4E0
9,CA89494AD121A8DC
10,FCA7A9D99D36338B
11,2E0FD54FCF000E13
12,4F09976CA4CF80C9
13,B49F719CC4A8BD7E
