stop_order,stop_id
1,9001559964CBF493
2,260B43921BAFD8CB
3,D54A59914E577E3F
4,3F01C915E856B018
5,6282A73360ACEBEA
6,8F78659628BA6795
7,DC6C23E16605C5EF
8,CF75BC81CDF3D411
9,E202C2F74E3A033B
10,0ABE48106C953AC9
11,9D3BCB233237C32C
12,9E3D2E34F849E298
13,56B7437C9A25161E
14,3ABF1C6B0195D580
15,613ED01D077362A9
16,A432A047D1B0DD62
17,29A62A8FE112766B
18,9751EE79B103C9B8
19,B123EFA9F9DDD6AB
20,E275C17540BCEF37
21,6D1087ACF14C15A9
22,46ABE64DB9C82DDF
23,5974E3D924697E4C
24,CCAC1239A80FFE6B
25,317CDFC0C1DB2ADF
26,9508A6CF0AF1E1B2
27,B8B71BC8E2DDCA8D
28,62AB7611613EF561
29,EEBBD352B7F16E3F
30,6762DEA1B89E6354
31,D32CCF88E6FD8621
