stop_order,stop_id
1,6F206EE9D2AF0838
2,BCA3944D7B62C178
3,F8E10FE7A5E12FAC
4,0016BA6EDE99B8E3
5,265B143AC892EE78
6,B65DB5330193E38E
7,A0424645102B1D9C
8,64A04DC2ADEE57E6
9,EC2573EE5FF42AAC
10,B4962A215D3DFA65
11,6B7C2A21D95241A5
12,DEBD2B9A856C0B1F
13,6DF1AF2871D4B7D9
14,196A1E44C305C174
15,BDE0F1679E1C8ABF
16,13458794A52910B0
17,67DFAB691BECE339
18,6D016EBFA090D535
19,04D3244DD2B38746
20,59B81980AC8F7878
21,4236C502F947A6DF
22,C78F66DF6FA871B6
23,8D7CB6C3D48258D6
24,CA1C0FB0345F9675
25,A2BE47AFF20CD4F6
26,CC6B75E6D60B4C57
27,26AC2D471648CA0C
28,00EC5193F83C6F76
