stop_order,stop_id
1,11E5EB00D58B8B4C
2,537168ECCA2CE578
3,D85AF13DC2FB0118
4,91481C9100917BA7
5,40829C12642639D4
6,16A7F2C343AA6DE6
7,4B0E21EDF07F9C83
8,1CF4AE2F7045B848
9,880BE8598CB0CCE7
10,5E073AD8BC9F2AC8
11,B31E6B9D8E5B4493
12,3A450B5AD5AF1605
13,0E2175C0750054FE
14,0D4E07F475845DB3
15,29E6A8ED7109BE28
