stop_order,stop_id
1,3D3122319983EAC4
2,2DF5E48438A56E56
3,01920071384D131D
4,50C82DFB0AC97FC8
5,7E4358262A4F586A
6,FA0F3FFF968619F2
7,B3C1A7541DDBB708
8,FD9F24DFA3090351
9,D9C045AD58C8CD38
10,16166F0A6907133D
11,11B2034DDF30617A
12,33033960343A57A8
13,F6A446C66F7F805E
14,35CD2E3911AEA038
15,C847FC07707BC068
16,AA62C03711F778F2
17,661FEE32A0D73EB0
18,D446D1EA79502BF2
19,FE3B13A457EEA70C
20,F203BEDE3E90A5BA
21,3BB1407BA61E0A9B
22,100E6F60BAC1BDEB
23,C970D8254790191E
24,6557A31762F5311F
25,90ED381AD3BAE4F9
26,534DB02642325617
