stop_order,stop_id
1,F5D322119DCA0F5A
2,FE2815CBCD21C57C
3,F2508598F5A43655
4,3313287185163530
5,9CAF2FDA35EEF9E2
6,940A31DA2A6051A9
7,62958067B9C06318
8,5419928D472EAD8D
9,4624AC39DB25D456
10,2DB47A3C263E4F5C
11,088B858E4B54D8AC
12,05D8591BD5405ED4
13,258EDF9D3C3FD200
14,DE27CD3EB0AF43D8
15,68A3AF80BADFDE9F
16,89A4D25AC31A8388
17,6465986EF7824816
18,C53A00F15DC2DB20
19,48E5A1EED91712EE
20,D099C45C9443AFC8
21,45D0CFA28B3FEFE5
22,B0D6494AF630229A
23,B6B1AB47AB07887F
24,CCC5BAA6257BBDAA
25,5E63913862E61D96
26,9179E2F718D0F436
27,437D60C455A624E6
28,A23337DAF4A8B168
29,CDB292D507E4302D
30,403CF34C7A6517DF
31,10D38620E5CAEBB3
32,9DF152ED984CD4A0
33,6716018C3EE42733
34,27222F0DE22582ED
35,9316961F98692D0A
36,67FC11E66080F9C2
