stop_order,stop_id
1,001685
2,001436
3,001437
4,001440
5,001441
6,001443
7,001444
8,001447
9,001556
10,001557
11,001559
12,001562
13,001564
14,001471
15,001411
16,001476
17,001335
18,001374
19,002561
20,001213
21,001259
22,001260
23,001261
24,001262
25,001264
26,001265
27,002677
28,001267
29,001268
30,001393
31,001270
32,001296
33,001297
34,001298
35,002694
36,001207
