stop_order,stop_id
1,06990DFEA90A3147
2,B3D81B76B30B1366
3,A1C3FAC9A09BDBC7
4,C97AC68CBB433F59
5,8F9E235D3D6081DB
6,EBEB497D57BB5B34
7,C9B1C3B9D0BA0D14
8,9F13E4D02222A819
9,65CC7FF852DEB184
10,0968AEB32CDE49EE
11,698AD748223B2BEA
12,9BEBB2D3B05DD529
13,849062B1454057E3
14,BEAAE3DA63C543BD
15,FD3E79D1B5A2237F
16,FFB21D12A61560FE
17,B7039F29C48A3CC2
18,1C179AC6FE83C808
19,8CD6C24187EC56A6
20,D992534B2A407C74
21,4E224310C4B46C9A
22,3F545756160D7BEA
23,BFA3460955AC820C
24,5FB1FCAF80F3D97D
25,FF4785270078B487
26,76457B949CBCDE7B
