stop_order,stop_id
1,001238
2,001328
3,001329
4,001330
5,001391
6,001331
7,001212
8,001211
9,001250
10,001208
11,001234
12,001235
13,001236
14,001237
15,001348
16,001349
17,001290
18,001291
19,002533
20,002534
21,002465
22,002439
23,002440
24,002442
25,002444
26,003415
