stop_order,stop_id
1,6ACF3394256E280F
2,4E870B220826BEE0
3,DE2B114C5B1EEA91
4,117F6DFC29E97F0A
5,5736A90A7D7E8F66
6,61D7306AC40C4FB8
7,5BDACC01F1655F27
8,21A1859E80CD542A
9,6C1C752975B8A257
10,783CE18C333C6069
11,8E3A5C15E42020BB
12,96442B84082D4DF5
13,508D99EBC9AB3A9B
14,FE56DD70DEDE0395
15,D2217D7746597D10
16,576538E1395C8508
17,C175ACB534E8C15C
18,4139F73177AF267D
19,E45CFAB2E6E4C8FE
20,691550E17EAE9D00
