stop_order,stop_id
1,001315
2,001367
3,001288
4,001273
5,001274
6,001275
7,001276
8,001277
9,001279
10,001628
11,001926
12,003551
13,003552
14,003553
15,003554
16,003555
17,001908
18,001909
19,001910
20,001928
21,001952
22,003761
