stop_order,stop_id
1,B3B0EF2BC688751D
2,E21F0D67FF45797F
3,07B714029E91FD81
4,4D777935A801201A
5,2560149CE75EABA0
6,21FC719DAF5F9D28
7,F36F422FDC6B9D3F
8,972145F4BB2B535F
9,8EAD803DDD2C3BBA
10,DAE9E14BA67CEC80
11,3A5C336CCB38A3FA
12,7BA304A9D0662541
13,943DA171019723CE
14,495A6186451A78E3
15,B71D38598F3C942D
16,783CE18C333C6069
17,C0AA7F3501EFA657
18,25B94D808EC232D8
19,2F165341B07CBDB9
20,FD1B403FD4EC3E8D
21,E1DA8EB2EA9A4B3C
