stop_order,stop_id
1,001676
2,001677
3,001678
4,001679
5,001680
6,002908
7,001672
8,001726
9,001727
10,001754
11,001818
12,001819
13,001820
14,002917
15,001778
16,001728
17,001751
18,003589
19,001695
20,001690
21,001524
22,001761
23,001765
24,001725
25,001853
26,001856
27,001855
28,001864
29,001839
30,001863
31,001866
32,001867
33,001844
34,002657
35,001832
36,001833
37,001834
38,001836
39,002671
