stop_order,stop_id
1,13A191322410A410
2,C650BECDAF9D9EB0
3,9CAF2FDA35EEF9E2
4,AB057A63C24E990E
5,62958067B9C06318
6,5419928D472EAD8D
7,EC07D92834F5430B
8,B046BFB6CCD3E7CE
9,076E1E9D5874C41D
10,DD161A7AB0D39192
11,DFE346B2C7332BC0
12,2B3A6C000BB085CD
13,EC49B6F5634BC0C2
14,BC301D7E7F063331
15,CBE54DB551C24A02
16,78B537644BD4FE00
17,00B4635AE83E7EC5
18,507D90B4B976DBD6
19,1F6BFDF34BABCE6A
20,0C677A6B6266DB52
21,ECE3F3BE270C27E2
22,5B3258C7E0856895
