stop_order,stop_id
1,FBCC3CF2291E526E
2,25F3EF8ACD865DFB
3,478A61BE44E34707
4,9E1F0E5A57F3D3D5
5,4B17C55C032D3A37
6,52AE04E9C3E77BE1
7,F727B37E25DC4C88
8,DCC8F8655EB76754
9,AA6F0A2661759A49
10,52A8DA8958AFCCA6
11,0EAFBD8737911A6A
12,E435F72ACB8438ED
13,60A445D9ACD40C12
14,118450CCC68E42C6
15,6AAC8E541D9BD80C
16,1E15CFA82F408124
17,CD4626E2F32FE372
18,25E34120CA3AD554
19,6D9EB45795E40B40
20,02824AAFC038FA20
21,0FB4AEA370913FD2
22,78B3C90A0D7DDDE3
23,E2AE7A37634C8FE5
24,B954B8082D1AA9B0
25,7FE552E3792C9047
26,5587F6CBEF8C74F1
27,468DB19F9ECA7507
28,030A0F57C577B5EA
29,F1A6B3410C090751
30,0BFC5F7FC4A2D431
31,AC1A0FA3D0743FCC
