stop_order,stop_id
1,3856383C8A22904A
2,B4F2BAAED2470D0A
3,75C0DF6C7724CEEA
4,EBF4EB34B96BC242
5,3FE93821145B65F5
6,264B29FD223D9C4E
7,3E376000C84807D6
8,C84CAD6CCD18F87F
9,EC038424C17E0B60
10,478ACE8A8C9A2705
11,A13C2C1D5D3EE0D7
12,DC99E9AAD0DFB39F
13,AE7C79C814E6BD95
14,D5382A8A3773E6FE
15,FCBCC90E0ECE4F58
16,0B4807A5C0DAF24A
17,AB10F01039440464
18,299184738ADD432A
19,B596DF51C1BDDB19
20,7FE0FCDBF45276EF
21,7D41FC4EE12CB8FD
22,9CF00A30796B6B2B
23,FB948853081A003E
24,3856383C8A22904A
