stop_order,stop_id
1,4937A56C05FABA08
2,AC4EEE801BB9133C
3,5CD6A0A0CE6B53B6
4,32A2D05A195364DC
5,BC932662BA367CD0
6,E207DBF95EA7DE26
7,D625B0997C3DBCFE
8,67727D444E2EC42B
9,3161D898CD89AA38
10,9DBBC71CB1578A87
11,312CD2A987AA2773
12,40E8A4AA35AEB18A
13,55EE74AF2D1A7DAA
14,6F5585807DB07812
15,D060669C0A3DD8D1
16,D01D18C6EB79F84B
17,A72D15160CC3AF31
18,8D5C58075D3C1003
19,B0DDF2CD704116C8
20,6C1DEF32B8CB92C4
21,161B32AD4C6996AD
22,6965D1D655C2DD5F
23,BB172B3A5DAC85A4
24,D7A05B5BAF07A89B
25,3D717F0365D5505B
26,29759ECB92E1A91B
27,B48B8F12CD929F0F
28,42ED08E8B1829CED
29,D4707218581C0F72
30,327E4BC13954EA86
31,B0EE4F50D82034E0
32,9268B442F0C2807E
33,3F4B54625D1F9E48
34,4937A56C05FABA08
