stop_order,stop_id
1,001939
2,001935
3,001936
4,001937
5,002008
6,002009
7,002011
8,002012
9,002034
10,001922
11,002598
12,002599
13,002600
14,002601
15,003358
16,001629
17,001028
18,001029
19,001030
20,001174
21,002427
22,002432
23,002435
24,002438
25,002535
26,002536
