stop_order,stop_id
1,81969BBB9A9F321A
2,5B04604E989BBDF0
3,8C67C373BC19EDF5
4,0ACB63B00DEE1B37
5,E21A497AF62AF38F
6,CEA9610F9443BD8D
7,06E1120EA9A7BF69
8,91AED9CBCE81500D
9,31B93EAF018D6956
10,F1ED37F1BA6D054F
11,C57C924EEB5463E5
12,16A7F2C343AA6DE6
13,4B0E21EDF07F9C83
14,1CF4AE2F7045B848
15,CB667DC000F66D40
16,857F6F958A96DCDB
17,180DC2E520E7A4D0
18,1E04D9D97DE148C2
19,4B5F39DBC6671C81
20,4CC126E0B1E42F14
21,A90443FD0C19C4B1
22,541FF05FA053F2B5
