stop_order,stop_id
1,77FB32597CCD30F5
2,3199543D3AE70527
3,2B354AE312900DF1
4,AA5DA45828958EAE
5,876057D899CE09C9
6,FA553D19AD960A9B
7,642F7D358D36F715
8,F269ACD809D1B43E
9,68354B780EDFC52B
10,665CE110A84542E9
11,2560149CE75EABA0
12,21FC719DAF5F9D28
13,854BC3A8D4DE6AA9
14,09A156B1A802D093
15,BD34A7B702373B12
16,E30C2815DA280036
17,C06334CA2AF7814B
18,E5EBA1D47BA06FCC
19,18C138014DF5B0C8
20,0FDE3A87457539BC
21,4459E386C8525C34
22,E19A8D46E934E346
