stop_order,stop_id
1,8237ED597A8A948B
2,A4455CCA999A234C
3,3C821C86ADED2B9D
4,14BDB94A8F3ED3EC
5,FA7A3D77713061E9
6,C7120BD9A94B4F6A
7,825199DC3BC0C5A3
8,A8F178C255CF9783
9,ADB9356BBF06F7C7
10,8E3F5AE0A97053F9
11,68C7CBB4CAB9FE69
12,9CD9BFAE2BC91336
13,E86A26B1A389C290
14,4E655B25ABAE103A
15,18785E68EAD3D9B8
