stop_order,stop_id
1,6C4DDD9C22580CA2
2,D360B3EBF155C15A
3,713BF17AF24FE4DA
4,FA09C95ECE002018
5,785E8178E7DB0A93
6,692CEF512B0D029B
7,210CF8389F782535
8,DF9E89A391CAC245
9,657E5836BC932790
10,850F72123F644500
11,7A1C43F91CF8A6FC
12,98FCC750B322B706
13,BC294083A50B89DB
14,38CBB6C76211934F
15,F63C76EC97E38A91
16,777ED0B1F3CF10DD
17,EDF107F1315D6805
18,5241470E37FA628F
19,EAE9158BE729E917
20,11A1269F9B78F269
21,E507F6160447C129
22,5E2EC7476D55E0BA
