stop_order,stop_id
1,002591
2,001227
3,001228
4,001372
5,001301
6,001302
7,001303
8,001367
9,001288
10,001271
11,001273
12,001274
13,001276
14,001628
15,003584
16,003077
17,003094
18,003344
19,003345
20,003582
21,003583
22,003455
23,003456
