stop_order,stop_id
1,002392
2,002393
3,002394
4,002697
5,002317
6,002680
7,002339
8,002340
9,002342
10,002226
11,002227
12,002228
13,002229
14,002230
15,002231
16,002232
17,001109
18,001110
19,001111
20,001112
21,001113
22,001114
23,002758
24,001190
25,001628
26,002862
27,001483
28,001546
29,001547
30,001548
31,001552
32,001554
33,001555
34,001426
35,001429
36,002810
37,001602
38,002813
39,002808
40,002836
