stop_order,stop_id
1,36348FA62122EA3C
2,E3B77FDA167AE325
3,3C9E0D9FBEA28AC6
4,DC28E30AF099D339
5,95A8334E0385A5E7
6,4A68E282FEB3DAED
7,AB10F01039440464
8,354A2C15BD189228
9,87668BC629020844
10,645D996BAD54FBBC
11,A68A34F71D94FF13
12,643D73028E9E8490
13,E3B0A57678CFD140
14,324EF7E116289941
15,B10F5697E4DA810B
16,73FE2D32F218DA9C
17,A264255E81F51111
18,223DAE7E925E3BB9
