stop_order,stop_id
1,63F9F0AFDF272DBA
2,A9E1D35DB7FC7C7B
3,C185612B431B197A
4,E778E67CBC095B0C
5,2FBEE4E1965D7EF5
6,95067FE712E8ACEA
7,8C05A4807E4601AC
8,E81E4649EB1D5B02
9,2150919C68CAE98E
10,279C78D8C04A83BB
11,5C473EE9644E7392
12,B68FB7076BB07A22
13,553D370FA21F7DA4
14,72999453ECAC4693
15,AA26D9F25826AA4A
16,9A0959AB68FA5E1F
17,94358F5481BAE505
18,07521BB848913F74
19,5D8FCEF2915882FD
20,C2605DED84199B84
21,CF579AAA2A4E506C
22,0B8C52E4C34E3B64
23,9689432947997FE9
24,144E9479168069DD
25,F36C1B3AC57D96FA
26,B1B0E08245C0FC15
27,2E2AD8BFE00F9FAB
28,3CB982FBC9E50AAA
29,F49FA120DE5E6582
30,1EF0671DB830C59D
31,23727783D2D3E994
32,EF17FDCDDF170D38
33,9B6A35DE470F8064
