stop_order,stop_id
1,F11DEDBBCD090BCC
2,A1D3216AF158C117
3,2560149CE75EABA0
4,21FC719DAF5F9D28
5,854BC3A8D4DE6AA9
6,09A156B1A802D093
7,BD34A7B702373B12
8,E30C2815DA280036
9,C06334CA2AF7814B
10,E5EBA1D47BA06FCC
11,18C138014DF5B0C8
12,0FDE3A87457539BC
13,4459E386C8525C34
14,A7D3749EF3C6B8CE
