stop_order,stop_id
1,FB45B8223CB9312F
2,E5CD4F98F31F239C
3,0CF8C59B80E70369
4,72B24F5DD57E3AE3
5,E0E2097354500456
6,BCC6E5BA6810FED6
7,22D525468860D203
8,C296D9B3313C1F77
9,53AC50E46ABDA85B
10,AB0F79ED382081D0
11,3ECEF3B735084236
12,447C1D79A10C83E2
13,4DB8054CDFBB9E43
14,F6EE4DC41A299593
15,FE56DD70DEDE0395
16,D2217D7746597D10
17,5D75A800F823B45D
18,1864222D8939BD69
19,EE5D9C9A5622C786
20,8FFE414EC5D76825
