stop_order,stop_id
1,6D1FFB57C26F1108
2,93E0033436973DA7
3,917DF4AF0ED7B258
4,7FB952821E3FCAD2
5,DB6981B82045B45C
6,ACE23D880D07ABB1
7,A8054881B534B00A
8,E51BB6A7525BA679
9,76F0BFCC3D78F888
10,BA55DB38DEF14AD4
11,6B582CAEDE8FBDEF
12,94780B40412261CE
