stop_order,stop_id
1,F0852C7827CC97EB
2,7E3C2CA5ABEC8416
3,51D13DDB8EBA98AF
4,30D564180B68ECA8
5,EDDE9311F49AC296
6,D9B53E4B3A192940
7,BC7C325EE59235E4
8,9E256D7EE9FE68BC
9,DF942A6B97EABDC4
10,2DDD1CB69E981669
11,80B56E2C7719DAF4
12,71E3EB7E709522C7
13,8D0555A78A132018
14,24BFA8C2C9E9F5DB
