stop_order,stop_id
1,002584
2,002979
3,002889
4,001525
5,001472
6,001699
7,001450
8,001451
9,001577
10,001530
11,001814
12,001538
13,001539
14,001643
15,001644
16,001415
17,001476
18,002673
19,002566
20,002537
21,002445
22,002446
23,002448
24,001140
25,001142
26,001054
27,001055
28,001056
29,001057
30,001027
