stop_order,stop_id
1,21E3E95EAEB2048C
2,AB5CF1D729028A16
3,9762FC524B26C4A7
4,7A95C545D0393126
5,5CCBD9A6B58BF20D
6,A6AED77D365E7011
7,EAE9158BE729E917
8,452AD79BA74CF8F3
9,E3A083E4F64D93CD
10,2EEB9CB69FB6A58D
11,450A96AF1DA8E41C
12,DD161A7AB0D39192
13,FB9FA7AAA17E9E9D
14,2EC5A7EB9CA821D9
15,C50C67D1BFF70DDF
16,EDE9E3D28B42969D
