stop_order,stop_id
1,001315
2,001367
3,001288
4,001273
5,001274
6,001275
7,001276
8,001277
9,001279
10,001628
11,003556
12,003771
13,003106
14,003096
15,003097
16,003095
17,003635
18,003636
19,003637
20,002047
21,003560
22,003561
23,003294
24,003602
25,003603
