stop_order,stop_id
1,D834EE67780F47CD
2,FE801C732EC6EA42
3,6D4E7B9D5F9584E7
4,5D9E516680412A3E
5,8D56DB404D264D5A
6,A00D00FC2F4F8400
7,C052B4D46E1F48EA
8,AFB9321F7CD2C2E4
9,7898B605E39613A8
10,0BC0F64B076ED373
11,5DE9BD1D773946A0
12,1C0A89BD67A4CFF0
13,E0E2097354500456
14,BCC6E5BA6810FED6
15,4EE417C5EF5FEF4E
16,51BD0FD05C62F3F4
17,53AC50E46ABDA85B
18,30A583775F35FD7D
19,3ECEF3B735084236
20,211D93217331B040
21,81B719F7DC3F0FAD
22,9E8E99C5BB698AC2
23,B9270C10E51D95F4
24,D507B4722D750F5A
25,7377B802B9C37904
