stop_order,stop_id
1,001027
2,001044
3,002737
4,001051
5,001137
6,002427
7,002431
8,002413
9,002539
10,002968
11,001475
12,001805
13,001806
14,001807
15,001478
16,001479
17,001397
18,002985
19,002986
20,002987
21,003026
