stop_order,stop_id
1,8D804CFD9C7B9042
2,AB057A63C24E990E
3,2946BA6CACA326DF
4,6C34AE386C779E0B
5,3C9C928E1674AB98
6,775FC7E2B86C4E3F
7,01A56227D21AFB04
8,221A18C37331E6FD
9,3C50188583DABFC8
10,EA59A314ABB9386E
11,AB0E13408BFA1055
12,6045969736940272
13,F851B0B122F38CCC
14,2FA93329F924968F
15,1E58DF8CAD59712E
16,12B08A64756B780B
17,0AB522DFFCD4CD4F
18,7210357910C44570
19,A1C65E46464147A0
20,100E6F60BAC1BDEB
21,23AF5995FEBCA8E6
22,8C09B3648DCDAF3C
23,D530D698BC181839
24,4D3C6D74F6AE8C7D
25,9627881F2180C5AB
26,2437897A21642D85
27,17A8BC1197F76422
28,D3FEF85E4DAEEE4E
29,C3201264CC8E5C5D
30,C8830886D41FB5FA
31,9615800192F1667C
32,D17050E8964504BB
33,04DDF4F7F1C74876
34,A3ADFCDF8487ADB9
