stop_order,stop_id
1,0A3466DCC6F4196C
2,91481C9100917BA7
3,40829C12642639D4
4,16A7F2C343AA6DE6
5,4B0E21EDF07F9C83
6,1CF4AE2F7045B848
7,CB667DC000F66D40
8,5E073AD8BC9F2AC8
9,B31E6B9D8E5B4493
10,3A450B5AD5AF1605
11,5E082FCF5C58328C
12,4B5F39DBC6671C81
13,4CC126E0B1E42F14
14,A90443FD0C19C4B1
15,9AD30F8EDBC3F139
