stop_order,stop_id
1,1380D71251D0CBF9
2,EDFAC4F35C0E51C7
3,FEC59562CBC99F5E
4,650809D260BC7C6E
5,F81DACC5F39E6D53
6,D417A444017171C6
7,D876A83244ECB838
8,CACE8456C1A48D50
9,8C1810DE2419A30B
10,6DE63371E5E799BA
11,512C07C3D131AB5A
12,BBFADA4889A61FCC
13,628613296EF92C64
14,0962265A8720C38C
15,EA01416B0BB7E485
