stop_order,stop_id
1,BDC2CE95D0E17000
2,E3B77FDA167AE325
3,3C9E0D9FBEA28AC6
4,952DD8539E6DAC75
5,E3AB394138EDE467
6,D597E0A9258D0894
7,FA343B97309B84B4
8,E7E5E3C1F761966F
9,062B0243536F0816
10,13B39CD775874ED9
11,08A97AD10693B841
12,42E5CC0772775C7E
13,1D75CC7D0B671EEE
14,79BB89DA868D93CF
15,BE47845FF3E717FC
16,50E78EB09845863E
17,A6013462EAC8AA50
18,2035C91B61C6DFC0
19,3A5C336CCB38A3FA
20,789384E5DC5AF7A9
21,0F4D809AED62F6E9
22,833DE523F16B97C3
23,A70DCB46EC98F43E
24,DE56F722C9293A68
25,D01D18C6EB79F84B
26,68A3AF80BADFDE9F
27,AB741CA56ABEA9F2
28,853C70D76FF68196
29,7CA14768A9D3B451
30,F19BBC7D6F39B210
31,05AB3A2B3816CD41
32,2537C3F076011C21
33,FACE6E102E2171B3
34,A0F2A2C5182526AA
35,73567AD9A1510A9B
36,FEF7B371B95E5E13
37,9E655CE3250647EA
38,2C7AEE8C6B2BC06A
39,0B8D095A45B05587
40,6098480103C44C62
