stop_order,stop_id
1,0035CDF15614428C
2,5759B937A26C377E
3,45AB0EC4F195CA7A
4,66BF94751BD28BAD
5,4432C7295979305C
6,CCA2F903BFE60A31
7,620E14F31DA31490
8,0E61C7B5C90B8CAF
9,09DF70F8DE2426BE
10,7019D5AE9C63EE72
11,92A8281D80524F78
12,031CF3D5B2BE9CE8
13,7F8529494720703C
14,36880B47F043D519
15,4E870B220826BEE0
16,5AD2A4D21C226335
17,A454170B2B59B587
18,F41714406F2D4E00
