stop_order,stop_id
1,002202
2,002262
3,002263
4,002170
5,002171
6,002172
7,002173
8,002210
9,002211
10,002212
11,002160
12,002161
13,002162
14,002163
15,002333
16,002334
17,002335
18,002338
19,002226
20,002183
21,002184
22,002185
23,002187
24,002227
25,002228
26,002229
27,002230
28,002231
29,002232
30,002681
31,002683
32,002685
33,002686
34,002688
35,002690
36,001159
37,001160
38,001161
39,001162
40,001163
41,001022
42,001081
43,001079
44,001059
45,001060
46,001192
47,001190
48,001628
49,001853
50,002714
51,003550
52,003540
