stop_order,stop_id
1,002891
2,002890
3,003228
4,001762
5,002854
6,002855
7,002856
8,001635
9,002810
10,001602
11,002887
12,002809
13,003143
14,002830
15,002831
16,003310
17,003311
18,003312
19,003065
