stop_order,stop_id
1,9FD5C5940A1D7212
2,95B249916F323BD4
3,5D6FB6C3F67A70DC
4,5734545592215022
5,CAD1ABCBA72CF365
6,AF04BB6F5FFF4C45
7,12E4BAFA2B73435B
8,30D564180B68ECA8
9,9A0959AB68FA5E1F
10,81C6D8E74259157E
11,5D8FCEF2915882FD
12,C2605DED84199B84
13,BF8E440F5584D39D
14,1001A444985DA59D
