stop_order,stop_id
1,CE1BEC7176C47D52
2,BD9D7DAC7CD2F537
3,AD2AE1E443FB8908
4,59073C1C6D8BB1F7
5,A9069A17B1474D76
6,3007D34FB91FB27E
7,1AB934EFE0E1470A
8,E74202351AF7F37D
9,9DA98A5E3914E2E3
10,E1F7BDC43A19F5AC
11,991E47DBD416B908
12,9274EF6791CA3ED8
13,CDB292D507E4302D
14,05485C36CA334A81
15,530F970BB56D778D
16,6716018C3EE42733
17,09DFD305F09C558E
