stop_order,stop_id
1,AA92A3F2775F4F69
2,471AB47F0E2C6E89
3,5AD0EDD70D540E29
4,D7F4AE9D52F68682
5,147EF2F26EFE2BEF
6,0C080F70E16F02B7
7,73755A16EA9076FF
8,F60E8E7D4B29135F
9,65181866025B5605
10,4DD9CB2D8C7DB1D8
11,F24C06FAF6EE076F
12,775642281FBFE336
13,B85641FDDED22352
14,8C8037479F88F500
15,C9EE59A0517F9BCB
16,0412B5C2C05B00AD
17,AC0BDA78C106FF7A
18,277DD90A63454F48
19,40AC79F25124280A
20,86F4FDCF2F5D13ED
21,52C7FFE6629F5972
22,7211E63DE150A10E
23,AAC64BCDD5B55A86
24,A99B6BB7F1628A08
25,21466046C6868AA7
26,23C2E672FA95C807
