stop_order,stop_id
1,0C4F5FC61E73367C
2,4A68B87D533BA937
3,F4FF1AAF9A7EB07A
4,8AFF8B43EC3E547F
5,83C4F756489484B5
6,ED9E5ACF98190E5C
7,D7D5410F2F97D682
8,DA87D4887F5FAF62
9,81F1ECC7278CDC18
10,2D36E1CF8C4FF699
11,8316A5C8798768AF
12,96D0ED04D761DBE4
13,B069D9C12F89AAFA
14,E5763322877BB340
15,48769F0B9F6E6C1B
16,93F4EA3D82B33BEF
17,3DD784D9B2C30AFC
18,9E970734315233A2
19,40A0B70767CA3F13
20,4BDF62F2A7C32429
21,92A8281D80524F78
22,966267086A03D688
