stop_order,stop_id
1,003484
2,003543
3,003485
4,003486
5,003487
6,001913
7,002031
8,001885
9,001886
10,001887
11,001888
12,001889
13,001890
14,001891
15,001892
16,002048
17,002049
18,001893
19,001894
20,002050
21,003363
22,001629
23,001027
24,001029
25,001031
26,001174
27,002427
28,002432
29,002435
30,002437
31,002555
32,002535
33,002536
