stop_order,stop_id
1,001138
2,001054
3,001121
4,001124
5,001126
6,001127
7,001134
8,001135
9,001130
10,001131
11,001119
12,001116
13,001117
14,001120
15,001118
16,002234
17,002236
18,002237
19,002238
20,002239
21,002240
22,002233
23,002260
24,002388
25,002363
26,002159
27,002167
28,002168
29,002169
30,002936
31,002263
32,002364
