stop_order,stop_id
1,6571D5C2A2184B8D
2,F8A31970F2A8E25C
3,1BD82E4312536F0C
4,1E88575F644EF7D4
5,ADA4B4F4B604885B
6,9364661BEAC5B8D0
7,8D386F5D210C3439
8,2F4939964761E1FF
9,1030A4E612B75901
10,DE27CD3EB0AF43D8
11,D01D18C6EB79F84B
12,B0DDF2CD704116C8
13,6C1DEF32B8CB92C4
14,B5AF3107F64607ED
15,448C1B8AECA89A6E
16,A0EFE3E68568F194
17,0C063E408709A8D3
18,A1C65E46464147A0
19,75957EA713E84A37
20,F60097D67F33DC0C
21,D0F8772D043C207E
22,E5E15C5F7F0344AB
23,598F766175BE3EF3
24,14CF94DF66FCD0C8
25,2A5B424322D35B0A
26,ED8812E232F6958A
27,9ACC26CD04287102
28,4E62491AA640A5EB
29,5527FF8CC85CF139
