stop_order,stop_id
1,1925FD4FD4E8881A
2,AB10F01039440464
3,B943DBEE65B0B18F
4,5AF593F7A11180E2
5,3F545756160D7BEA
6,B2C63864D1C98F56
7,033CB7A21D6DC60C
8,36880B47F043D519
9,4E870B220826BEE0
10,5AD2A4D21C226335
11,A454170B2B59B587
12,D6E7412666B1175B
13,AB87BD2749FFEACA
14,43398296F1D1BD48
15,67F3E54FF145BA65
16,F93448A5F1168FB1
17,DFB7FD5832A4BA4E
18,D34C171F5A6DCDA9
