stop_order,stop_id
1,A37BEF9605484BC3
2,276C17F1AFEA2C18
3,07B714029E91FD81
4,913F2DF20E573CEA
5,D198122830A4FDE3
6,99EF4CA10B3E1F17
7,F893C6ABC2743F64
8,38330C642568FE3F
9,A15FFC3149FB92A0
10,5D1E6432755E4F5F
11,279C78D8C04A83BB
12,BA03816A38B9DA7F
13,4BD5CE5106BB0697
14,6465DE9EE57F6C94
15,598F766175BE3EF3
16,EB177E95B39626AE
17,144E9479168069DD
18,7459D3AB11AFD6B5
19,9C839C3824F47A6A
20,CB4BB0008A87E4FC
21,E6FDF44FB2844B19
