stop_order,stop_id
1,430B9D9C6AFF364D
2,FE2815CBCD21C57C
3,F2508598F5A43655
4,3313287185163530
5,89D32777124F4039
6,8000ABB2A7252841
7,EA4A3876639F21B4
8,1B9CA570385CC6F2
9,6C34AE386C779E0B
10,3C9C928E1674AB98
11,038F62C619BF8650
12,A8E63F70F386C05A
13,E173F2DA030C6AAB
14,6E2A7A2CD29F9216
15,5CA7841E84D52C8A
16,22138E6C8051FDBD
17,3B8B261C1DA409BD
18,9DA7325E4238402B
19,195C509959C6A799
20,6DF1AF2871D4B7D9
21,196A1E44C305C174
22,BDE0F1679E1C8ABF
23,13458794A52910B0
24,67DFAB691BECE339
25,6D016EBFA090D535
26,04D3244DD2B38746
27,59B81980AC8F7878
28,4236C502F947A6DF
29,C78F66DF6FA871B6
30,8D7CB6C3D48258D6
31,5D919BA157405E33
32,A2BE47AFF20CD4F6
33,CC6B75E6D60B4C57
34,26AC2D471648CA0C
