stop_order,stop_id
1,886559B17A8D61EC
2,A088D19226D59E98
3,6573811D015A0818
4,A22E315AD21129EB
5,C837C3C549793472
6,9BE3D659E4C144D2
7,000CFEE2F92DC17B
8,53BB93AAB2D45F3B
9,6C2DBC45160AA4BF
10,E5F082F4C7300273
11,91E946260F8BCBE8
12,A911ACA189669DB4
13,91E946260F8BCBE8
