stop_order,stop_id
1,3229F37E6637B0ED
2,808CA5FECCC6646D
3,30D564180B68ECA8
4,D80313EC29620E1D
5,D9B53E4B3A192940
6,BC7C325EE59235E4
7,9E256D7EE9FE68BC
8,DF942A6B97EABDC4
9,2DDD1CB69E981669
10,80B56E2C7719DAF4
11,71E3EB7E709522C7
12,8D0555A78A132018
13,24BFA8C2C9E9F5DB
