stop_order,stop_id
1,7234BEA4242461F7
2,C458B4A40BFCC4FF
3,9D3BCB233237C32C
4,4E56DD827C1F571A
5,8F28FEF1946A7FE3
6,F608A74B860B3C47
7,92B3E07F00FBB305
8,61CB41A4FE2AD8E5
9,60F6F482EFA8FE18
10,C6A76DB999AF1213
11,C7C1C12D89968698
12,E34E3D48842C9B66
13,4E037679702BBCBC
14,67C00FA00C878C1A
15,9A83CAB8FB930EEE
16,B2B63870BF0309F5
17,4BB3E2907D3ED1CB
18,5D01986FB5E538CC
19,AE4D7869B643DAA2
20,AE2A53D953B640BE
21,F5795A904B483F33
22,2C7AEE8C6B2BC06A
23,0B8D095A45B05587
24,E6DCDD4CCE10E4B7
