stop_order,stop_id
1,37E653F1DC727EB2
2,CB295B56D3762A1F
3,F8B3E5A11921AD1B
4,C66CDE62B5AEB8DA
5,832EFD8F5165814E
6,F7670D87C1847D31
7,BE5E07865E13374E
8,94236C65C84D8C17
9,4C82D99D0721ADE9
10,399EF919E10C7F33
11,56F79FB1FC157E22
12,6DE63371E5E799BA
13,5734545592215022
14,3FD481FB9B9DC36C
15,12E4BAFA2B73435B
16,74648B92E0E80E2E
17,4DD5EC5516B360D7
18,33ABA49F0E91A247
19,B34F59A0270AEDA4
20,B644204AEDE7A031
21,5C2A974134634635
22,A0D379E172F5BC93
23,853CD1316EB5227B
24,BE6EC9708F5FB613
25,30D564180B68ECA8
26,EDDE9311F49AC296
27,D9B53E4B3A192940
28,060699911C9E300F
29,9E256D7EE9FE68BC
30,DF942A6B97EABDC4
31,136E2FF5A3A98495
32,80B56E2C7719DAF4
33,71E3EB7E709522C7
34,8D0555A78A132018
35,0D9932C476D51576
