stop_order,stop_id
1,001115
2,001111
3,001112
4,001188
5,001006
6,001007
7,001092
8,001091
9,001146
10,001147
11,001148
12,001149
13,001150
14,001072
15,001073
16,001136
17,001255
18,001257
19,001258
20,001267
21,001268
22,001269
23,001270
24,001313
