stop_order,stop_id
1,86A7D57B3275BC96
2,E114ADD0B146D4CA
3,A919C2BFC31695EE
4,47E68CD8B89FD64D
5,58858CC869297C4A
6,F1C0B762655B89E4
7,996069D6FEF7D71A
8,75CE4282D2043790
9,C00C986B85A2220E
10,3328A22FC67A46F9
11,9335E0F061724158
12,D678B3364437D16B
13,2EF9764BE18FC290
14,F1A90CEE2B8C40CC
15,45C2286729E1475B
16,DBEA3F848C7981F2
17,84BACA14B0C50790
18,03F7818C0E176C55
19,9268B442F0C2807E
20,E7116B44D9E9393A
21,942E95B4336BDFA7
22,360587444784CEAB
