stop_order,stop_id
1,001664
2,001786
3,001744
4,001663
5,001665
6,001756
7,001666
8,001667
9,001668
10,001669
11,001656
12,003458
13,001509
14,001510
15,001518
16,001519
17,001463
18,001278
19,001281
20,001283
21,001286
22,001215
23,002439
24,002440
25,002442
26,002444
27,002446
28,001141
29,001142
30,001053
31,001056
32,001037
33,001027
