stop_order,stop_id
1,D32CCF88E6FD8621
2,CDB60E6F75A1D7EA
3,9B761917E5D9A80D
4,26CEAEF7BD0F6F59
5,48E68D36FFC315F6
6,1F3E9C9CC6FC869A
7,6458484907C76A06
8,E697B8AFFADE6E21
9,229C618DE131245A
10,C49D1FFAEBDFE617
11,BBC5D60D2FB827D2
12,36EE1028F547488D
13,094457650286AA67
14,9CB216DC49F84CFA
15,D198122830A4FDE3
16,99EF4CA10B3E1F17
17,B0D6494AF630229A
18,B6B1AB47AB07887F
19,3523AA15D7F22A3F
20,5E63913862E61D96
21,142BE7225B0BB745
22,AFC5E64568DBB2D5
23,ABFB3F43ECB908B2
24,C1E9F8237EDBBAD2
25,24E16716BBB7F2D0
26,4BFB5F2D496CDA56
27,51FCE282462E418B
28,F8BB84BC801E4C85
29,BC39BFC3C7BC3009
30,2FABE52A66DF7482
31,C1E1199805BCC92D
32,9001559964CBF493
