stop_order,stop_id
1,FD18FAF570857B51
2,A9E1D35DB7FC7C7B
3,7E177E3E89B58BFE
4,FDFC87BC94515900
5,E778E67CBC095B0C
6,D4E2DC0F24A22589
7,0D39977C225DD2D5
8,AC30AF0DFC95D507
9,62A1C8EFAC876BDB
10,93D9D88C2D990D67
11,74C71F2AE4947E5D
12,968575D69434DBB8
13,210CF8389F782535
14,2431FF3100478DEE
15,ED6FCB0422D541F5
16,850F72123F644500
17,7A1C43F91CF8A6FC
18,60F1DDDCB555E319
19,65B934D14EA190F1
20,6F5585807DB07812
21,68D0BC0C7164F763
22,7BE18698D0E8FDCE
23,8748720365CEA134
24,25B94D808EC232D8
25,E049C81469E2B3C0
26,076E1E9D5874C41D
27,D06E5A5B162EF1BA
28,577490AF159C4088
