stop_order,stop_id
1,610D6DDB5A3E99F1
2,CC70125C02A60585
3,C06FB5A6B411531F
4,E83A9BC796627F57
5,D10D7250FE345946
6,A44D983C2E3C7F1D
7,DF3F6652DC307265
8,D4136D223D5EFF10
9,57E8535707AE3EEB
10,B05D756C845FA4D4
11,84FB4D7D386169D7
12,7A8EFDDC5E341FCD
13,193F348597404EFC
14,D03560F5A7014BB3
15,C97621D676C9EFE6
16,D9E7FBC3599B5EE0
17,CDB292D507E4302D
18,05485C36CA334A81
19,530F970BB56D778D
20,6716018C3EE42733
21,27222F0DE22582ED
