stop_order,stop_id
1,29E6A8ED7109BE28
2,4CC126E0B1E42F14
3,013F884CBCB1CBE4
4,7E2611CD03F9450A
5,D96A94B0ED4E873A
6,F4BBC1AF35CA2765
7,30553FA19D045D25
8,34740DD5ABC36F12
9,25E1BAE2C272ED4C
10,0D56ED01EED431BC
11,6AE1163C3BD93D0E
12,548DAB3A4F71EB68
13,D242CDB564D5CCA2
14,99B9CAA698C36C5E
15,5127D55F08E1E6F7
