stop_order,stop_id
1,003660
2,003661
3,003663
4,003664
5,003665
6,003666
7,003667
8,003668
9,003669
10,003670
11,001986
12,003590
13,003591
14,003689
15,001655
16,003047
17,003369
18,003505
19,003709
