stop_order,stop_id
1,A453A24D622091F0
2,67DFAB691BECE339
3,6D016EBFA090D535
4,04D3244DD2B38746
5,59B81980AC8F7878
6,4236C502F947A6DF
7,42AC6356E7A6D159
8,8D7CB6C3D48258D6
9,28725EBEC5C8EC40
10,FD80BB497E0791CA
11,C9E264A3F9D4CEB3
12,094D2EBC017EE61A
13,2658CCFAB79763B6
14,E615D61C588B8F9D
15,C3672D8D28801773
16,34FBE7E973FE5EF5
17,D198122830A4FDE3
18,99EF4CA10B3E1F17
19,326199D24220A42B
20,F893C6ABC2743F64
21,9FD865B00B2D54A1
22,A15FFC3149FB92A0
23,5D1E6432755E4F5F
24,279C78D8C04A83BB
25,BA03816A38B9DA7F
26,D0F8772D043C207E
27,BE36EF30B86ADD1D
28,3E73B73B12E25DCF
29,38B86AC474D1060D
30,EB177E95B39626AE
31,5AAC6A858427D04E
32,F36C1B3AC57D96FA
33,87549D6B12E322E5
