stop_order,stop_id
1,001382
2,001311
3,001366
4,001312
5,001226
6,001227
7,001228
8,001372
9,002693
10,002568
11,002414
12,002424
13,002434
14,002435
15,002437
16,002438
17,002574
18,001213
19,001251
