stop_order,stop_id
1,2CEEB19BC6404A39
2,7E3C2CA5ABEC8416
3,BCEEE192EF01C361
4,3F01C915E856B018
5,6282A73360ACEBEA
6,8F78659628BA6795
7,D55177A9D510B2E2
8,B8E228521E55C7C5
9,6AE1163C3BD93D0E
10,548DAB3A4F71EB68
11,D242CDB564D5CCA2
12,582E6E50ED66EB11
13,D137ADD65D333E0B
14,142BE7225B0BB745
15,AFC5E64568DBB2D5
16,A295FD27A4E5A7C5
17,82F22BA7623AA4CB
18,A9FFF4974D4AC160
19,51FCE282462E418B
20,F8BB84BC801E4C85
21,BC39BFC3C7BC3009
22,2FABE52A66DF7482
23,C1E1199805BCC92D
24,2CEEB19BC6404A39
