stop_order,stop_id
1,002994
2,003055
3,002721
4,002722
5,002723
6,002995
7,002996
8,002997
9,001415
10,001537
11,002558
12,002487
13,002569
14,002488
15,002489
16,001141
17,001053
18,001184
19,001027
