stop_order,stop_id
1,DE9F24A5FF5A89E9
2,1A900DC34DE206FD
3,EE775A73D626A46E
4,D417A444017171C6
5,57E8A522E2C638FD
6,9170FC8FFFD12204
7,D2C1DACCC74B69C5
8,EBE1766B508217AF
9,EE775A73D626A46E
10,D417A444017171C6
11,D876A83244ECB838
12,9170FC8FFFD12204
13,D2C1DACCC74B69C5
14,11B894BF379B1BFC
15,DE9F24A5FF5A89E9
