stop_order,stop_id
1,C08929D9D44B1C49
2,5A0D9C9441ED6AC5
3,9BF9C994F2DAE15D
4,B76B249D3D253008
5,A7F35DC09E1A1528
6,D242B538BA760551
7,3CE4A2049409A6DD
8,E6ED785726AED4AE
9,D5C36653A51759C3
10,F75C1A9AFDBB52F1
11,A88468CF154B16E9
12,A468A530A8C84E11
13,CF17F8C87DBBF2BC
14,D52D3F3FB66EF61A
15,6DF1AF2871D4B7D9
16,196A1E44C305C174
17,BDE0F1679E1C8ABF
18,13458794A52910B0
19,3F13933D0157CFCF
20,A2BE47AFF20CD4F6
21,F88EE882E4B77399
