stop_order,stop_id
1,001837
2,001845
3,001831
4,001872
5,001838
6,001842
7,001862
8,001858
9,001859
10,001857
11,001854
12,002862
13,001483
14,001484
15,003054
16,001477
17,001596
18,001478
19,001479
20,001397
21,003352
22,001534
23,001535
24,001536
25,001529
26,001572
27,001642
28,003005
29,001689
30,003279
31,003280
32,003281
33,003282
