stop_order,stop_id
1,E9B13F8E482054DC
2,A0BB7387E8F22C49
3,59A591C17AEB1AF6
4,C458B4A40BFCC4FF
5,D92BEED0C736EF59
6,4E56DD827C1F571A
7,8F28FEF1946A7FE3
8,3ABF1C6B0195D580
9,480DB16994F8FFEE
10,F3433105FE5F6865
11,FB9FA7AAA17E9E9D
12,FE56DD70DEDE0395
13,D2217D7746597D10
14,576538E1395C8508
15,1E5EADCD9F424F07
