stop_order,stop_id
1,B7A9E1A243516288
2,EFB9F85F98113CB0
3,55B5E2A727CAA86D
4,E757600B79B0B2AC
5,4039C75BB85BF238
6,FCCAC3FC3C8A66E2
7,E3B8D0FF5C269463
8,A6631CAD2E2DE2A6
9,6ACFA599CC0EA4E0
10,84FC122EC64D8885
11,197315C40E767929
12,225D34B4D891AFB1
13,412DEEF534E127AF
14,AAC64BCDD5B55A86
15,D3B54388E91DAB57
16,C552CE565E1F0C85
17,0D5759F7A4B185FE
18,21466046C6868AA7
