stop_order,stop_id
1,B390D5F9AC9CF57B
2,BEEBDDB542A7E709
3,48184733EFE9D3E3
4,89D32777124F4039
5,DAE7B6CB56131B50
6,5419928D472EAD8D
7,53E802F94BDF5048
8,B0668BFF6178BA0B
9,3CB94742E4B5E3E5
10,33033960343A57A8
11,BE27F066CF40DF7D
12,62F395D60229C8F5
13,1FBAAE29AF1CA50E
14,03C3F537C41E4986
15,2FFC93C766E566B5
16,F5A61D37E2DDA9D8
17,31079A9B244C679B
18,ABC15E2110BF7A49
19,BC66863007C0592B
20,848CA90EB0DB1146
21,7486D53F341F1AAC
22,FC42DCBDC3AB0B6F
23,22E2678081E88368
24,7613538D58A9C452
25,336FF66D1F0AC4A0
26,D732B7AE560F7326
27,99A3DFDBDF41F0E9
28,75E1777F474658CA
