stop_order,stop_id
1,8B6421F5CD63D612
2,3C0AF6BA82588E2F
3,F8DEE1D5F9A349AD
4,4A14A012710E80B1
5,3216F11DA45B80D7
6,6F106FD26B684372
7,26305AF62FBEE2BC
8,A8CE52F4450FE939
9,41E81A921D79F375
10,BFF2560B1C1687B2
11,0CA3C6C38D2F3F75
12,FAF9EF8853A3B65E
13,EDFC39232C98E301
14,449F6831A832F1F3
15,3E54E8AF4083B065
16,3F4B54625D1F9E48
17,F663E12DC37F3C5A
18,D2B43459063F53DB
19,7995F69FE44D0DB3
20,F90ED764C7A95649
21,041DFA7A1729D20C
22,5CCBD9A6B58BF20D
23,A37F8CF766FCF9F3
24,EAE9158BE729E917
25,D2217D7746597D10
26,576538E1395C8508
27,1864222D8939BD69
28,E74C9012605BA534
