stop_order,stop_id
1,4D8E5172E1C1EAF5
2,D156C558FF163BE3
3,013F884CBCB1CBE4
4,1D99BD02B9B45429
5,028E0B68D3166C00
6,1D6A8B8C58C268FF
7,F86BDB236D6ACDC3
8,30553FA19D045D25
9,4A3D71FFAB41B756
10,A78292AA77A277A7
11,578C11F0F4197509
12,A295FD27A4E5A7C5
13,C43782B93826F4CD
14,2223D64E9ED2E1A7
15,4D3CBBDB95447F2E
16,D1D807234805DBF4
17,76B4054F2E1F00B0
18,17B98BD1165A7B92
