stop_order,stop_id
1,93A608CBFD9D5128
2,5CDF70DDB539B39B
3,020B06374E07A1B9
4,CEDD8C935E63648C
5,C20316E552E64387
6,B6C73B7C3607611B
7,8C6AEEC9E76F7852
8,8370DDFF896AC3E0
9,01B4E1C4514C35E2
10,7C8F479D41B69151
11,3B5F1B8C69EAE397
12,90A0828B57A59906
13,79C0E2525F4B50FF
14,D921F140F4006272
15,8366B8BB0703BB8C
16,334A391D9FD2C201
