stop_order,stop_id
1,87CA6EFD0FFAF72A
2,EF103F0ED7C9BE45
3,71429CEA8EA90958
4,EABEA7DC579C5F3E
5,15EB974CD32E9FB2
6,A4D7F88689232BE9
7,F88278FBE1C3FF34
8,315B55985B328146
9,325788C7375BFC0B
10,6564600C3B5BFB65
11,FE3B71A48A6B0C30
12,950140C36BBC6369
13,28C36BBE416103C2
14,BC301D7E7F063331
15,CBE54DB551C24A02
16,0C677A6B6266DB52
17,ECE3F3BE270C27E2
18,594A765BE3A43C73
19,507D90B4B976DBD6
20,692B63F1A1F42D8C
