stop_order,stop_id
1,20AEF0F80E06013D
2,86201D4BB45ED201
3,5BD8484E82721AF9
4,F2DFF3A02940D925
5,F00B9766890B9FD5
6,A14D4AF63BFAB364
7,1159654D863462B1
8,3AE0CA0446E027D5
9,A4B015A5BA35DDF9
10,A033D7537C3E1920
11,80818BFC3FE76A5B
12,4566E35B3D2C20B5
13,5055F6D68F0DD49D
14,4D02E857ADDE8AAF
15,2BDF4BB3B2E038A2
16,B876788F86A8D127
17,D9B82EE66AFF2975
18,CEDD8C935E63648C
19,521ACE041201135C
20,DAC9F4035C02B5B2
21,6174C11305616FCA
22,1C49FFB3352144AC
23,5498C13EB8685C46
24,7C8F479D41B69151
25,213CF009551C7C39
26,5AF9ADB51A9F2C51
27,CE9312CA8B00024E
28,0E63473C95554A20
29,ADD19B88AA8E99DC
30,F6282DDA0B14F96A
31,F87A56BD0A2640ED
32,D54B0CA58FE5559D
33,3D566753F149907F
34,F16C067FBC346D71
