stop_order,stop_id
1,B360C922B3B180C9
2,FC6CB9607D36FBD7
3,DF8F6AA868615D47
4,807FF45E7E451237
5,1A0C476BD432E0FB
6,0B5E21C03B8B3FEF
7,703C9055CEBF534C
8,341C682AEFD4F676
9,94EFE46EB0C81130
10,C2A924BD041BD901
11,BF9CD8F3D1FB7066
12,7F3A8DEBB43372A9
13,4F593414D37CAE92
14,B55B2A016DD04490
15,22C53EDBADCC95DD
16,EAFE42A7BC8FD2B3
17,131148372E2D2D19
18,7D91D5A0183FF3C4
19,36344A885EA03837
20,31F83DAA95A4B53A
21,6B35AF30748EDA1B
22,2D10E16919B5A96E
23,F0D6CB5F04988EA4
24,09601DB251157030
25,B683B48A5CCC6C2B
26,4EBE182141C52094
27,EA74F13EEC20AD91
28,9229BF150F3C53BC
29,3291342581C48037
30,D1C1E33BB9350C65
31,F6FDEAF741BFBD2E
32,1345D70225C59BD3
33,3210F3BCFFD74E61
34,BFCFEBF6F5C35402
35,F8B3A5C8D0D3CED7
36,3D5F826FD00C0529
37,876CF2E8C375F78B
38,6386333EDAC64C96
39,0FD6C16477F1F0E8
40,6A4B371546D489BF
41,E81DF9AB738F076E
