stop_order,stop_id
1,8FD9863802F38CDB
2,51288CE4C842111E
3,B76B249D3D253008
4,73129107791388E6
5,1F453ABA9EA89D7B
6,77505F1651DFA82F
7,6D81BF91C256E963
8,5F181A62BBCA16F7
9,AAA29653BB050609
10,551045DD53EA529D
11,A88468CF154B16E9
12,D355B700FF30B3D7
13,1B68DD9D137F906D
14,3E3443C5CB7C83AD
15,F39F638D34947E40
16,CA5B809B8263373E
17,EE0ACB2B516C305E
18,45A499CD3132E90A
19,B035018DFD9028C3
20,F7005C63821245C3
21,02E2C6CDE2A867C1
22,849062B1454057E3
23,BEAAE3DA63C543BD
24,FD3E79D1B5A2237F
25,FFB21D12A61560FE
26,2BDB51D5618D546F
27,A7E87E8D797D1A52
28,132584D5CB2235BC
29,D580682442940BB2
