stop_order,stop_id
1,28725EBEC5C8EC40
2,C9E264A3F9D4CEB3
3,094D2EBC017EE61A
4,2658CCFAB79763B6
5,E615D61C588B8F9D
6,C3672D8D28801773
7,34FBE7E973FE5EF5
8,D0F8772D043C207E
9,BE36EF30B86ADD1D
10,3E73B73B12E25DCF
11,38B86AC474D1060D
12,EB177E95B39626AE
13,5AAC6A858427D04E
14,87549D6B12E322E5
