stop_order,stop_id
1,001145
2,001044
3,001049
4,001030
5,001031
6,003337
7,002422
8,002423
9,002559
10,001216
11,001217
12,001218
13,001219
14,001220
15,001221
16,001336
17,001337
18,001338
19,003286
20,001224
21,001225
22,002591
