stop_order,stop_id
1,01B4E1C4514C35E2
2,4DD9CB2D8C7DB1D8
3,F24C06FAF6EE076F
4,775642281FBFE336
5,B85641FDDED22352
6,8C8037479F88F500
7,C9EE59A0517F9BCB
8,0412B5C2C05B00AD
9,AC0BDA78C106FF7A
10,277DD90A63454F48
11,40AC79F25124280A
12,86F4FDCF2F5D13ED
13,52C7FFE6629F5972
14,7211E63DE150A10E
15,AAC64BCDD5B55A86
16,A99B6BB7F1628A08
17,21466046C6868AA7
18,23C2E672FA95C807
