stop_order,stop_id
1,4D5FBE4639E869E3
2,5D75A800F823B45D
3,C175ACB534E8C15C
4,4139F73177AF267D
5,3D040EE809057C6E
6,AE264B401D72411A
7,EE5D9C9A5622C786
8,AC48794DF1F3332C
9,DC74D0FA83E25E8D
10,BEB1BBD9E816FA59
11,E80A3E968CCEEFF7
12,4960882151DB05E0
13,590E23621FD23B6C
14,F4B357B11344180D
15,5C6534DD562AEF61
16,B9BC3DE30A48F08B
17,3FB80081AB2FF6FB
18,7F25B423230F5BEE
19,CFCA63CAF4C25D2B
20,D446D1EA79502BF2
21,DE9BE04046C197C4
22,88E23CD2F1AB7AF9
23,0B160DE955F3AE10
24,830FACA208087E37
25,964AA1DCAAD06512
26,D237B30F94B6065D
27,7D025E77F4B35266
28,EE3B5ABCB87027E7
29,688797454F595B1F
