stop_order,stop_id
1,CBB9FC4A0C13979B
2,F01F8CF411A34AA7
3,A6013462EAC8AA50
4,2035C91B61C6DFC0
5,AAB25066B96C6588
6,789384E5DC5AF7A9
7,0F4D809AED62F6E9
8,833DE523F16B97C3
9,A70DCB46EC98F43E
10,7B98BAE3D93817AC
11,F3540B3A1B36BBF5
12,D01D18C6EB79F84B
13,A72D15160CC3AF31
14,83CAC07FF3CA1BDA
15,B0DDF2CD704116C8
16,6C1DEF32B8CB92C4
17,20A7DAD5A8294964
18,A0EFE3E68568F194
19,97D1981DE7ECBCE7
20,3998A0C9E65D379B
21,B64E0F355A9F4223
22,FC42DCBDC3AB0B6F
23,22E2678081E88368
24,7613538D58A9C452
25,336FF66D1F0AC4A0
26,54FCA9F5D8F3587E
27,A9478A97C59FE581
28,815BC43527FD9247
29,B3F2EC8E42FA3184
30,2307DECBF51E9D7F
31,07142A6203E50A47
32,E92E009DE3307F85
33,FC56A42F8EF929FA
