stop_order,stop_id
1,941B58A78A49CD0B
2,BC50F731DFC77A7F
3,EE0ACB2B516C305E
4,45A499CD3132E90A
5,2351E4570FFCE620
6,AB10F01039440464
7,354A2C15BD189228
8,C7FC5050194509AE
9,A8430DB27637D95F
10,E78E2B8A6B0251F4
11,C1590716F6FABC50
12,3CCF4F6EA48CF505
13,7AECAF57AF679EE7
14,116624D40FDE852C
15,DA8B258D68133BDD
16,75DEBB78067301B8
17,D4CE0ED4DF009B66
18,B714B480F96C22D5
19,531B557CFBFFD232
20,F626C47C1F73E1AE
21,813A44129E51981F
22,8972CD96C0B11BB2
23,4AA82FE086BA80FD
24,3410D9B6EF36D674
25,9D88EE061FF5E1D0
26,03B2C07AC4117C59
27,3F0C9DF601178557
28,2BD0ACE05ADB9AD1
29,459BE083B86A8337
30,665CE110A84542E9
31,20EB4ED56F4442E9
32,ABDD74161F650B6E
33,8890B5BA8EC088D9
