stop_order,stop_id
1,7467743E276518E9
2,3B487B85E3F07416
3,67387941757BB9DC
4,FACA192DB8589295
5,7C99CFD0D8908BE7
6,CDB292D507E4302D
7,C55F50E43F6108EB
8,530F970BB56D778D
9,6716018C3EE42733
10,3DDE81FE5DB08180
11,1A0BF02F827F6A20
12,9FDEEC09AD1B601B
13,8BD1BD1B2D687075
