stop_order,stop_id
1,E435992628015D22
2,D04102C22195B7C4
3,F2F74DC6ADD35CFF
4,24078B675A7FE3B3
5,DBB8E01BBE8C66ED
6,7DF092F3A5418694
7,364754E2273129B7
8,FE6D5955F777E39C
9,0EE7033EEE2C4C8C
10,B876788F86A8D127
11,D9B82EE66AFF2975
12,4A76CDB32FA69BC6
13,CCED20D6135C0347
14,4D06ED7B22D4DF59
15,A57300FE17F39989
16,B22D7C482250DF80
17,11637A93A82A3C20
18,13568DBEFE3503A6
19,87F9F165B63331A5
20,540B42AF095A342C
21,15B81103A046F072
22,F8446E87636522E1
