stop_order,stop_id
1,001196
2,001176
3,001032
4,001031
5,001137
6,002427
7,002431
8,002572
9,002437
10,002555
11,001213
12,001251
13,001464
14,001985
15,001916
16,001917
17,001949
18,001944
19,001950
