stop_order,stop_id
1,06834C0C275F4DDC
2,2F1F9CF16B9E65AF
3,AD0B5EFA2471962C
4,0A24CC239F39F33E
5,E89B2315750AB2FD
6,F48CA8BC4044E42A
7,9274EF6791CA3ED8
8,CDB292D507E4302D
9,C55F50E43F6108EB
10,2AEDE966C122B71E
11,6716018C3EE42733
12,7BECB2120CD69543
