stop_order,stop_id
1,4D3DD33FCD9A49F9
2,D40C730A1930BABB
3,26CEAEF7BD0F6F59
4,242816965CAB8FE2
5,E09CA927E9BF25C5
6,524F66D9EBDACACD
7,FE824F449F3D217F
8,229C618DE131245A
9,C49D1FFAEBDFE617
10,BBC5D60D2FB827D2
11,36EE1028F547488D
12,094457650286AA67
13,9CB216DC49F84CFA
14,D198122830A4FDE3
15,99EF4CA10B3E1F17
16,B11E10F012C57433
17,A66159E033DDEA04
18,C92E80A5D7E0E8EC
19,52B02EAC7AAB23C1
20,3F6F5DC1DDA5F68E
21,6CDAC4513AD44DB7
22,196CE583CC4F8127
