stop_order,stop_id
1,3B68D3389F83FE39
2,ACA7282A66D0A29B
3,0C44BAE327DB4A8A
4,2B0183A25DA19AE3
5,70AED81BA5AE0B49
6,8F5CC6D12F796BC0
7,310E4FE9B7419F88
8,76D5C1E2B23E8743
9,587ACF2E1135D8B6
10,E3B464760B6ADF30
11,ADA4B4F4B604885B
12,9364661BEAC5B8D0
13,8D386F5D210C3439
14,2F4939964761E1FF
15,1030A4E612B75901
16,BD06457129045F1D
17,A72D15160CC3AF31
18,8D5C58075D3C1003
19,B0DDF2CD704116C8
20,6C1DEF32B8CB92C4
21,161B32AD4C6996AD
22,6965D1D655C2DD5F
23,E99D3F96A9F7B5EB
24,7210357910C44570
25,3D717F0365D5505B
26,100E6F60BAC1BDEB
27,F60097D67F33DC0C
28,5B49CF04EAB59906
29,921C19F6147C74A6
30,47C3597662B81B47
31,BA95025DE2FB9878
