stop_order,stop_id
1,F18230D9F2792E77
2,1E990292ADEF23A2
3,83A02749D0CB2EE8
4,3104B2FBA1EEE592
5,86D1BF834F627D5C
6,1D944152BA58ABF3
7,216AEF6F6541ECF1
8,1ACA45F806F2554A
9,F69B2B317BEB37A3
10,2560149CE75EABA0
11,6437BDE588337654
12,D198122830A4FDE3
13,99EF4CA10B3E1F17
14,C847B9021C407731
15,38330C642568FE3F
16,A15FFC3149FB92A0
17,5D1E6432755E4F5F
18,279C78D8C04A83BB
19,BA03816A38B9DA7F
20,4BD5CE5106BB0697
21,6465DE9EE57F6C94
22,598F766175BE3EF3
23,0644E10571B8CA12
24,144E9479168069DD
25,7459D3AB11AFD6B5
26,9C839C3824F47A6A
27,CB4BB0008A87E4FC
28,CD3092383ACEF208
