stop_order,stop_id
1,001138
2,002430
3,002432
4,002434
5,002435
6,002437
7,002555
8,001213
9,001259
10,001260
11,001261
12,001263
13,001264
14,001464
15,001522
16,001521
17,003041
18,003042
19,003043
20,003044
21,003045
22,001719
23,001720
24,002702
25,001721
26,003071
27,003072
28,003068
