stop_order,stop_id
1,EB077E683E6C8DDA
2,5C1471822EE10AF3
3,6679BFB738009E11
4,C479E1DC6030850D
5,EDBB5387A44E2C4D
6,292239388EF150BA
7,5E416E4DD3488BAB
8,163F0AD0C3CD4CF2
9,9DDDCABF063188C7
10,FD3A4BA146CE57ED
11,EA7E50D4ADE95CC2
12,F7622E953F7E5D48
13,F754AED08F0B6B97
14,FADDB1E247E62936
15,87A9869FE7A4EF8B
16,B404A065F58A5F64
17,EB43D5BE03CB3346
18,350EBC52D2ABF3D8
19,D0BA1477EAFC2C2B
20,F1C0B762655B89E4
21,29DF8DB2E9741934
22,628DF6A22E9172F8
23,EE07E4C45A4CC134
24,E5054AD30B9831F3
25,11B2034DDF30617A
26,B0095CE9771BFC17
27,009760575EA9F85D
28,BEB1BBD9E816FA59
29,E80A3E968CCEEFF7
30,4960882151DB05E0
31,590E23621FD23B6C
32,F4B357B11344180D
33,5C6534DD562AEF61
34,7DF81D14A8CE574E
35,2F7C67769B9FB896
36,6AEFD1C261E8E4D8
37,661FEE32A0D73EB0
38,8815F901477E6435
39,20915DF05723C615
40,742F8953113CD926
