stop_order,stop_id
1,93A608CBFD9D5128
2,9C9F817064169CE7
3,61C957321A4DE4A9
4,E48E4C46F64FFB0E
5,5CDF70DDB539B39B
6,020B06374E07A1B9
7,CEDD8C935E63648C
8,C20316E552E64387
9,B6C73B7C3607611B
10,8C6AEEC9E76F7852
11,8370DDFF896AC3E0
12,01B4E1C4514C35E2
13,7C8F479D41B69151
14,3B5F1B8C69EAE397
15,90A0828B57A59906
16,79C0E2525F4B50FF
17,D921F140F4006272
18,8366B8BB0703BB8C
19,334A391D9FD2C201
