stop_order,stop_id
1,002364
2,002262
3,002263
4,002170
5,002172
6,002173
7,002210
8,002211
9,002212
10,002343
11,002383
12,002225
13,002347
14,002405
15,001475
16,001769
17,001547
18,001548
19,001552
20,001801
21,001426
22,001429
23,001430
24,001687
25,002885
26,001434
27,001517
28,002852
29,002853
30,002847
