stop_order,stop_id
1,5501654D47E432D4
2,4E655B25ABAE103A
3,AD4E0E8DC8ACEFB6
4,DF8F6AA868615D47
5,A264A7BA921EEE6E
6,ABE1BADF8D43CB24
7,6A90A40248059768
8,48D55BCE2E97E1DE
9,FBBF4EB577663A13
10,F97A667725CDEB82
11,73FE2D32F218DA9C
12,A264255E81F51111
13,A22733425D08E68A
