stop_order,stop_id
1,003415
2,002445
3,002447
4,001141
5,001142
6,001055
7,001056
8,001058
9,001040
10,001066
11,001067
12,001068
13,001069
14,001070
15,001628
16,001777
17,001692
18,001595
19,002850
20,002851
21,001801
22,001426
23,001429
24,001430
25,001687
26,002885
27,001434
28,001517
29,002852
30,002853
31,002847
