stop_order,stop_id
1,002935
2,002263
3,002166
4,002172
5,002173
6,002160
7,002161
8,002162
9,002163
10,002261
11,002226
12,002227
13,002228
14,002229
15,002230
16,002231
17,002232
18,001109
19,001110
20,001111
21,001112
22,001188
23,001006
24,001007
25,001092
26,001091
27,001146
28,001148
29,001149
30,001150
