stop_order,stopId
1,270
2,271
3,43
4,234
5,235
6,236
7,237
8,238
9,239
10,240
11,241
12,242
13,243
14,244
15,245
16,246
17,247
18,248
19,249
20,250
21,251
22,252
23,253
24,254
25,255
26,179
27,64
28,65
29,66
30,67
31,68
32,69
33,70
34,71
35,72
36,73
37,74
38,77
39,78
40,318
