stop_order,stop_id
1,939DD40498CB3066
2,38AD2E7846D11D52
3,203A1B18FDE58D89
4,90535913F657C516
5,F6E414A440CD7C70
6,718556B5D930CAFB
7,98D50686DF57B6F7
8,EC839AE65935149B
9,AE4E8F82AD65348C
10,225E8FAE869B3308
11,86B81946F9FA57FB
12,A07CC0A6D462A579
13,9E25CF3DAA0BA0C4
14,9541036143D6CCF1
15,13C75FFFA2BB060D
16,78277EF9D0189DED
17,79AFB35F9DBD485A
18,D5DB45916FCE114A
19,5D94D3084F0C3831
20,89A4D25AC31A8388
21,6465986EF7824816
22,C53A00F15DC2DB20
23,48E5A1EED91712EE
24,D099C45C9443AFC8
25,45D0CFA28B3FEFE5
26,B8E2647E9C5019C9
27,AAECA769A84E2372
28,A66159E033DDEA04
29,C92E80A5D7E0E8EC
30,07ADFF84F3502690
31,3F6F5DC1DDA5F68E
32,45809C20B6578E53
33,6953AEF8B3921959
34,99B9CAA698C36C5E
35,F0A8A596641FFC5A
