stop_order,stop_id
1,03A082D6B4C517D9
2,95CD775905DD716E
3,2219232721C0C943
4,426AA29947520120
5,81C7BD9D6BD4D8DE
6,5C57D7225C2FB032
7,4FF96DAA5FCBE1B6
8,B8D8C35525C57762
9,B959226950B0DEA7
10,81C38CE0FA77CBCF
11,3EC8AF0246E94A09
12,48CD670CA33290B3
13,326A0C5D99374762
14,773C9D3BB95AACC6
15,6BA43C06A9AD502A
16,742EB6200E03493B
17,B2A9D7F90A56F6EA
18,273C1BD825293576
19,79B88295548184C1
20,9CEC1F1000AFE806
21,5D86C919F15C0611
22,F63D25B428F1C1D9
23,2ADCFCFCCDDF2C9B
24,CDB292D507E4302D
25,0A8E2BA2F75E472E
26,FB7E3001FDAB2CB1
