stop_order,stop_id
1,001475
2,001480
3,002811
4,001482
5,001400
6,002838
7,001402
8,001587
9,001540
10,001417
11,001418
12,001476
13,001335
14,001248
15,001243
16,001244
17,001254
18,001256
19,001257
20,001379
21,001378
22,002792
23,001313
24,001315
25,001376
26,001350
27,001351
28,001352
29,002676
30,001353
31,001354
32,001355
33,001207
