stop_order,stop_id
1,F3D86A2A72FF3582
2,940A31DA2A6051A9
3,B0028A481BF4ACC7
4,5419928D472EAD8D
5,36DD78B37B828DD8
6,4624AC39DB25D456
7,088B858E4B54D8AC
8,F56B1C6169FFC940
9,4A2B9089021412CD
10,F2B574FB059E895F
11,141A31AE3569958B
12,89A4D25AC31A8388
13,6465986EF7824816
14,C53A00F15DC2DB20
15,48E5A1EED91712EE
16,D099C45C9443AFC8
17,45D0CFA28B3FEFE5
18,14BDB94A8F3ED3EC
19,D0FB28B8EED62431
20,C7120BD9A94B4F6A
21,825199DC3BC0C5A3
22,A8F178C255CF9783
23,ADB9356BBF06F7C7
24,8E3F5AE0A97053F9
25,D876A83244ECB838
26,CF0C67920B22ED62
