stop_order,stop_id
1,77BEA79A5FF7A21A
2,AB057A63C24E990E
3,2946BA6CACA326DF
4,1B9CA570385CC6F2
5,EBB057754E3423CE
6,3C9C928E1674AB98
7,A8E63F70F386C05A
8,E173F2DA030C6AAB
9,258EDF9D3C3FD200
10,99256D08CF861BA5
11,D0A763AFCDE36124
12,0BE28656FCEAAE17
13,CCAC1239A80FFE6B
14,317CDFC0C1DB2ADF
15,9508A6CF0AF1E1B2
16,B8B71BC8E2DDCA8D
17,62AB7611613EF561
18,A1AA846971415968
19,6762DEA1B89E6354
20,70349D91EC82AFE1
21,E35B5F1B80E085E6
22,EBEF10F95443B217
23,75EF762BDAB6F5C3
