stop_order,stop_id
1,8956F5FA7B620297
2,F4C9FD2549C6DD80
3,7A43DB86E881E02D
4,F3281CF8A2A2AD4A
5,6BF47953BB775A15
6,DB0A398B6B890051
7,D52D3F3FB66EF61A
8,3D01A5479C31FB05
9,85B41FEDE6611826
10,59B81980AC8F7878
11,4236C502F947A6DF
12,C78F66DF6FA871B6
13,8D7CB6C3D48258D6
14,36880B47F043D519
15,6E22023A7DF1B381
16,E45E7DB1786B6324
