stop_order,stop_id
1,DE5FEC673BB54DC5
2,36F7DCE4723C2C44
3,95FAB1D2AD752ECE
4,A5E27C280260D008
5,6638A31332E98C83
6,EAF0EAB6E30425BA
7,5EEFE2E2583B576B
8,1E0C8A961881DE1D
9,38F0C9768AA2AF93
10,30FEA8A7071EDE48
11,3CE4A2049409A6DD
12,E6ED785726AED4AE
13,E9F3DC5D89154BB7
14,1A85B99EDE6D01D8
15,04FC6E130D4953F4
16,D355B700FF30B3D7
17,1F51B830DD359962
18,91C7F46612ADD9EF
19,9B664F8FD4E76E48
20,20E8B4520A802912
21,D711AFA9658D51E9
22,3F545756160D7BEA
23,50C0A622B149C308
24,A73739F6D37090EE
25,07814531B88CD829
26,A722DAAC99CE03D4
27,5FD70A34C55CE590
28,17CDBCBA18D0D000
