stop_order,stop_id
1,F1F906098E7C35E9
2,857F6F958A96DCDB
3,03354DBC3AD86BAC
4,96B7D7C8DF39E707
5,6B46C7E695EF21CF
6,D9328F386A03DC36
7,ECE98AAA81373891
8,2CC81AE9D0A0E668
9,46F034381CE08F9C
10,4A3D71FFAB41B756
11,A78292AA77A277A7
12,FFBEBD7068E01EA4
13,DBF0C952CAA654B5
14,182976403F291FE0
15,B8760F28D7938609
16,3225E407F87D904C
17,DD5CDB226E98FD0B
18,78A74247AE9B466E
19,16A987682D402255
