stop_order,stop_id
1,B452F1514B4FEE40
2,EF5A5CD9C3A038C9
3,A5E27C280260D008
4,009760575EA9F85D
5,21581A1F9544F6E4
6,E80A3E968CCEEFF7
7,4960882151DB05E0
8,411A32C9BBF53857
9,489A72B19BE37AE1
10,A91745D47D69FF05
11,813962A51DF6DACE
12,2F7C67769B9FB896
13,A46B6AC99CE8722E
14,D7A05B5BAF07A89B
15,7BFC2AE979358DA7
16,02CF8D1FE31E9A09
17,B8E228521E55C7C5
18,40829C12642639D4
19,16A7F2C343AA6DE6
20,4B0E21EDF07F9C83
21,1CF4AE2F7045B848
22,A384FBA637A1EBC5
23,5E073AD8BC9F2AC8
24,B31E6B9D8E5B4493
25,0D0D7E774E1C1575
26,BA6D9F93E62B8075
