stop_order,stop_id
1,2FCE924121B95FE8
2,21AFFFF707224831
3,31BFA986DE84EDE1
4,177E7222D0968DE5
5,20B34B5CA0E66973
6,E21A497AF62AF38F
7,CEA9610F9443BD8D
8,A11DE40C25E0AB6A
9,26A996F589C84844
10,31B93EAF018D6956
11,AB194503D9CC9465
12,E47CD422B33E5BE7
13,99440967B8390837
14,BE4DB8D578A94BEF
15,33D8E30DCBD27040
16,B8E2647E9C5019C9
17,5EAE23D8DC3A7121
18,A28C2F29B58A2E9A
19,BA9F2C58E03A38F0
20,CA5AEC11C96BA678
21,BE4CE56A7102816E
22,BE58B5A4B0E76EF7
23,45D9CC8527BC3261
24,6DE243D2C36B9C6A
25,6D76E141FB820044
26,17F010FBF594E572
