stop_order,stop_id
1,534DB02642325617
2,79E1F84E966F6113
3,E905F8E518AE17B6
4,24AD2532770CF399
5,5564FED01546FF23
6,44DE41D495197976
7,0A87C29A2B460C96
8,ED5554C57CF0061C
9,4D9419874306D82F
10,55EE74AF2D1A7DAA
11,F7CAA2D4FF9D61F7
12,DEB8D7D95E7D528A
13,4AF3A5BD16E5BA3F
14,D3C41BB36EC805E0
15,44C261864506654B
16,098AF67CBBB9FBA9
17,D355B700FF30B3D7
18,6762DEA1B89E6354
19,3B68D3389F83FE39
