stop_order,stop_id
1,82C6FB4FF5612428
2,72999453ECAC4693
3,AA26D9F25826AA4A
4,FBE38593BDEB0802
5,9A0959AB68FA5E1F
6,94358F5481BAE505
7,3CE7B5D1EBF9C5F7
8,750ADEB14D018CF7
9,49229D04FCA51B61
10,55AE88BFD351F56D
11,3093477EA64DDA89
12,BFF2560B1C1687B2
13,0CA3C6C38D2F3F75
14,FAF9EF8853A3B65E
15,09CFF9F9E78A6B17
16,F140654A12BA066A
17,59FF8DDFC4405C0D
18,DE60928B8CFD9E7C
19,6557A31762F5311F
20,90ED381AD3BAE4F9
21,147E43B06313402E
