stop_order,stop_id
1,CF0C67920B22ED62
2,98EBAB9468C80DD2
3,6DD6B837EF1FA76C
4,AFD29CB1A4F71AB9
5,60952B4A38F3D82E
6,0E41E02CD9055626
7,EE81A30BE4BDC8AC
8,F129DD8D9E3268FB
9,D0FB28B8EED62431
10,FA52803E2628A212
11,2431FF3100478DEE
12,ED6FCB0422D541F5
13,850F72123F644500
14,98FCC750B322B706
15,66C6FDFC88F56E51
16,7CD8F96A087CDDF2
17,F3D86A2A72FF3582
