stop_order,stop_id
1,E346E933481C3D83
2,130015EE1C05A484
3,0F9DE5E3F13FBABA
4,FCE8D0E0D2A89B8B
5,D77779E531F14725
6,4F64DA53415F3128
7,BF7FD3BC4994EBE5
8,9DC117C78DBDB1A7
9,BD52FF1BA0AC99BE
10,1F2376A52800A2CA
11,0B72FFAB7F7230E4
12,0CF05B00D82FECB2
13,9B664F8FD4E76E48
14,20E8B4520A802912
15,5823104B79279940
16,E368E68412AB685C
17,0653C07D043A0E97
