stop_order,stopId
1,221
2,222
3,224
4,225
5,226
6,227
7,228
8,229
9,230
10,232
11,233
12,234
13,235
14,40
15,236
16,237
17,238
18,239
19,240
20,241
21,242
22,243
23,32
24,30
25,244
26,245
27,246
28,247
29,248
30,249
31,250
32,251
33,252
34,253
35,254
36,255
37,179
38,64
39,65
40,66
41,67
42,68
43,69
44,70
45,71
46,72
47,73
48,74
49,185
50,76
51,77
52,78
53,79
