stop_order,stop_id
1,06C9926B2E2B304F
2,72F07CA66230A1BE
3,C19CD7CCA03DBEBA
4,EC157EA93B3DD279
5,FACE7DC841CEF78F
6,41E537666558ED07
7,687325CD84BA96A0
8,B4CF77BA0F9D34B8
9,671C0B06B1582C54
10,5F0966CBF6A909A3
11,B83A88488B3F6EAB
12,D533E8F25C189485
13,0F421E6B729C2D24
14,981A7F2220E8B3CA
15,2E0D7F52D1608C12
16,FC19ABA503C5FE51
