stop_order,stop_id
1,4AA350AD8FFF4786
2,AD97EA183A25102C
3,DFE346B2C7332BC0
4,872110C8ADA14DA1
5,25BC743BF6EB726E
6,7AC6625D894BA101
7,CBE54DB551C24A02
8,78B537644BD4FE00
9,542CC0EC83BAEA01
10,840532B7C95DF870
11,315BE0CA231DCD4F
12,EDF4C2EAFDBD4693
13,12CF2025741EF844
14,580D52F4D93CAD9B
15,3199543D3AE70527
16,F1D1F84A466543BE
17,CDE9BBBDE0226995
18,7FE552E3792C9047
19,5587F6CBEF8C74F1
20,468DB19F9ECA7507
21,030A0F57C577B5EA
22,F1A6B3410C090751
23,0BFC5F7FC4A2D431
24,595CE3974AB6F377
25,55E3A1A6E995A9CB
