stop_order,stop_id
1,002470
2,001248
3,001243
4,001244
5,001254
6,001256
7,001257
8,001216
9,001217
10,001218
11,001219
12,001220
13,001336
14,001337
15,001338
16,001223
17,001224
18,001225
19,001362
20,001369
21,001370
22,001382
