stop_order,stop_id
1,081EB225028BC80B
2,551DEE0C7120DECD
3,790B8E94D15A0888
4,30D564180B68ECA8
5,D80313EC29620E1D
6,D9B53E4B3A192940
7,060699911C9E300F
8,9E256D7EE9FE68BC
9,DF942A6B97EABDC4
10,136E2FF5A3A98495
11,80B56E2C7719DAF4
12,71E3EB7E709522C7
13,8D0555A78A132018
