stop_order,stop_id
1,002891
2,001762
3,002854
4,001777
5,001692
6,001595
7,001424
8,001585
9,001775
10,001559
11,001562
12,001564
13,001567
14,002811
15,001482
16,001586
17,001629
18,001070
19,001183
20,001003
21,001004
22,001005
23,001164
24,001165
25,001166
26,001167
27,001168
28,002384
29,002307
30,002308
31,002309
32,002310
33,002327
34,002311
35,002312
36,002313
37,002314
38,002315
39,002317
40,002318
41,002260
42,002298
43,002396
44,002294
45,002388
46,002157
47,002164
48,002165
49,002365
50,002366
51,002367
52,002368
53,002369
