stop_order,stop_id
1,E1EC10CCBB722DA4
2,F2508598F5A43655
3,3313287185163530
4,89D32777124F4039
5,1F2E60EDB4254D30
6,EA4A3876639F21B4
7,B0F64FFFBECE8AA4
8,2DB47A3C263E4F5C
9,6DFEED7F0DB44298
10,A6ACEA5D8F32521D
11,30FEA8A7071EDE48
12,3CE4A2049409A6DD
13,75C0DF6C7724CEEA
14,EBF4EB34B96BC242
15,3FE93821145B65F5
16,264B29FD223D9C4E
17,26C0B01357752657
18,C84CAD6CCD18F87F
19,478ACE8A8C9A2705
20,A13C2C1D5D3EE0D7
21,F718BAC64885E69E
22,C95751DB2112F279
23,F7AD8DE682AD5BB3
24,DC99E9AAD0DFB39F
