stop_order,stop_id
1,92BC52AEBC658E49
2,9B0382206D441221
3,5BE08E5DCD826740
4,1D5530B0037C0143
5,1078119989C67B82
6,FCDC63F245F7F22B
7,544FDBB0FC074ABC
8,D8CEF4232A0B7E4D
9,3CEDAAAC5071EF7B
10,4A84482F3A54E4CC
11,5D034EAC6A8853A3
12,70A7D4C9EDA6D50A
13,AE0DC8745DFCA0FA
14,25863CD2A364E72F
15,1E3A342DF7D5B8B5
16,0306B53F46955E3E
17,3F9AE21DC3A540B9
18,5FD7848A339751B6
19,9689432947997FE9
20,2A5B424322D35B0A
21,ED8812E232F6958A
22,62F395D60229C8F5
23,1FBAAE29AF1CA50E
24,03C3F537C41E4986
25,2FFC93C766E566B5
26,F5A61D37E2DDA9D8
27,31079A9B244C679B
28,ABC15E2110BF7A49
29,BC66863007C0592B
30,848CA90EB0DB1146
31,7486D53F341F1AAC
32,C73A03D6C468B767
33,22E2678081E88368
34,7613538D58A9C452
35,336FF66D1F0AC4A0
36,7E5A9F7D64C12E4C
37,99A3DFDBDF41F0E9
38,92BC52AEBC658E49
