stop_order,stop_id
1,17F010FBF594E572
2,E1F73A6B69F39365
3,02D4D2C0C430EAD0
4,60F6F482EFA8FE18
5,2A72F4041A7E6783
6,9C117FB6B6590825
7,5FB8DC89C84A7F2B
8,04C4E5AE4F8F21E1
9,1D13B640481F4CD1
10,AC2A4AB84E52364C
11,F3D3D5E7F698B748
12,C7C1C12D89968698
13,96A6FE5F07BDF203
14,9A0959AB68FA5E1F
15,81C6D8E74259157E
16,5D8FCEF2915882FD
17,C2605DED84199B84
18,BF8E440F5584D39D
19,8D0555A78A132018
