stop_order,stop_id
1,163F0E101B13D8AD
2,5A95921B376A97CB
3,84BACA14B0C50790
4,7FF51CFDFA30964A
5,34DCAF51F6056BB6
6,9A0959AB68FA5E1F
7,94358F5481BAE505
8,A24F5416BCCE60F9
9,F90ED764C7A95649
10,2BF5780A30BB85E1
11,4395252CFDC7AB1F
12,FB0488A31D3C13B8
13,1EE69CF61423B432
14,2BAE0D3A6CF25EB8
15,FED5FC9BD7B35D53
16,3015AF669161ADBF
17,5CE3ECA0F9501DAB
18,03411E63565CD911
19,94A696F37A3C7FB5
