stop_order,stop_id
1,003469
2,002410
3,002556
4,002474
5,001213
6,001259
7,001260
8,001261
9,001262
10,001373
11,001264
12,001265
13,001266
14,001267
15,001268
16,001269
17,001270
18,001296
19,001297
20,001298
21,001299
22,002770
23,001216
24,001217
25,001218
26,001219
27,001220
28,001221
29,001336
30,001337
31,001338
32,001223
33,001224
34,001225
35,001362
36,001369
37,001370
38,001382
