stop_order,stop_id
1,CBA0D271ED709D14
2,B190B4EE3D663C7D
3,B3E9198D7E377749
4,372CAD789479077E
5,1C8D366A8E0235D2
6,A99EAA9BF58E4AAE
7,9DD7971F2245445A
8,38E98CDA66797431
9,7B000C45829679BB
10,B42C02E04782AA24
11,B0E5C563CE57C375
12,7934A27F6D03DED6
13,12A827339D5B8454
14,C03A261956EEC378
15,163FC4BF240AFA4F
16,F264DF2F9F784D9F
17,286C969B42180EA0
18,D44D25EEC381AE44
19,66E438CBC36DA32F
20,47331F05FE637843
21,81423EF62957C8C6
22,A30F5B94F215CCBA
23,0F63227B1059FB0A
24,DC0ACF01ABE34E06
25,ECEBA677BFFECC4B
26,9064D9087DDD5811
27,AEE2BF6EF1B0E46E
28,16C6B12E0609B683
29,5868CBF1CE627437
