stop_order,stop_id
1,001837
2,001854
3,002032
4,001435
5,001436
6,001438
7,001442
8,001802
9,001446
10,001770
11,002849
12,001396
13,001423
14,002878
15,001595
16,002877
17,002860
18,003513
19,003514
20,003515
21,003516
22,002719
23,002720
24,003570
25,003000
26,003001
27,003002
28,002725
29,001422
