stop_order,stop_id
1,95BC0F9FBDCCC62B
2,EF5A5CD9C3A038C9
3,AC48794DF1F3332C
4,DC74D0FA83E25E8D
5,BEB1BBD9E816FA59
6,E80A3E968CCEEFF7
7,4960882151DB05E0
8,590E23621FD23B6C
9,F4B357B11344180D
10,5C6534DD562AEF61
11,B9BC3DE30A48F08B
12,3FB80081AB2FF6FB
13,7F25B423230F5BEE
14,CFCA63CAF4C25D2B
15,D446D1EA79502BF2
16,DE9BE04046C197C4
17,A0FDF34B2D278750
18,951CE3B3EB98BA3A
19,DB6981B82045B45C
20,ACE23D880D07ABB1
21,1DA57A1376E99AC6
22,964AA1DCAAD06512
23,D237B30F94B6065D
24,7D025E77F4B35266
25,CA866CBB3EC92B9F
