stop_order,stop_id
1,002847
2,003270
3,002848
4,001436
5,001437
6,001440
7,001441
8,001443
9,001444
10,001447
11,001556
12,001557
13,001559
14,001562
15,001564
16,001566
17,001471
18,001411
19,001537
20,002414
21,002348
22,002355
23,002356
24,002357
25,002358
26,002213
27,002210
28,002211
29,002167
30,002168
31,002166
