stop_order,stop_id
1,1ACC12FB59AE1A98
2,917DF4AF0ED7B258
3,92540DF9CB08304C
4,325D388E2C927954
5,E77716C29E34669E
6,00ACB49D76C8C16F
7,D64C1350EE61A2AD
8,D187AB3DC52090EF
9,40CC41621D07AA2D
10,6E8CB58283AF3CB1
11,5FFF428D657F1361
12,A06590AD808DC9A9
13,032C7D86DF9ED3AC
14,742D35CD1DEA10FD
15,8B5745F31A5778D7
16,D15281453EE5E0B4
17,A0934516C3FE8D29
18,D2F2B3C5436007C2
