stop_order,stop_id
1,23F3D6C7BDAD87EB
2,0E987A8094AF742E
3,6118B186F901485A
4,2DC2EF0A12E23C1F
5,AA4830D4C9864F6B
6,45FCFADAC74DCFFE
7,D693BB486419666B
8,330FCB2E8E28D4CF
9,C9BF57C6B2F9BB92
10,3D126591E55E8FA1
11,73DBA4ECE93BB290
12,5693912DEE916C4D
13,7DCD729826DDB645
14,C0E90AAAA204D927
15,AF837BAF1DA794EF
16,45D5520FF3329255
17,DC825DF01C49316F
