stop_order,stop_id
1,002891
2,001762
3,002854
4,002855
5,002856
6,001512
7,002857
8,002858
9,002859
10,002877
11,002860
12,002862
13,002863
14,003355
15,001629
16,001028
17,001029
18,001030
19,001174
20,002430
21,002432
22,002572
23,002437
24,002574
25,001213
26,001363
