stop_order,stop_id
1,001171
2,001144
3,001035
4,001124
5,001126
6,001127
7,001134
8,001135
9,001130
10,001131
11,001119
12,001116
13,001117
14,001120
15,001118
16,002681
17,002683
18,002685
19,002686
20,002688
21,002690
