stop_order,stop_id
1,FD18FAF570857B51
2,A9E1D35DB7FC7C7B
3,7E177E3E89B58BFE
4,FDFC87BC94515900
5,E778E67CBC095B0C
6,43EE0C39CD39BA06
7,EF01999C9F909553
8,B337148DB333E5C4
9,711A39D02DB2B4D8
10,AFB03B10416E2199
11,4B9D547F0F450784
12,17EB4B9A9DE2FAF6
13,BAA5C48341F400C8
14,401EAF24B736C5B6
15,6F5585807DB07812
16,68D0BC0C7164F763
17,7BE18698D0E8FDCE
18,8748720365CEA134
19,9DDE74BD2D803D9C
20,E10A0960D4E103B1
21,D6E03ECA84C07932
22,45F2E2A508556D6E
23,E3A083E4F64D93CD
24,577490AF159C4088
