stop_order,stop_id
1,75E1777F474658CA
2,76AA75F4BF183FB3
3,AF2DB48410CC6EC3
4,A332AF8FFAE8947D
5,D5E1A3D34328F867
6,1FAA805BF1635668
7,B9DF2752D1309B49
8,4D1A76F3B9785DFA
9,AC7D60B1E5251638
10,6AE5EC17DAE4E646
11,883E42D32C6AD101
12,9762FC524B26C4A7
13,7A95C545D0393126
14,5CCBD9A6B58BF20D
15,A37F8CF766FCF9F3
16,FE56DD70DEDE0395
17,1DEB855D55528B03
18,D2217D7746597D10
19,0840B3F75A7B00BD
20,C175ACB534E8C15C
21,4139F73177AF267D
22,E45CFAB2E6E4C8FE
23,B390D5F9AC9CF57B
