stop_order,stop_id
1,001588
2,001541
3,001542
4,001543
5,001544
6,001545
7,003334
8,001547
9,001549
10,001551
11,001553
12,001554
13,001555
14,001425
15,001427
16,001428
17,003303
18,001430
19,001431
20,001432
21,001433
22,001517
23,002033
24,002006
25,002007
26,001853
27,001856
28,001855
29,001864
30,001842
31,001839
32,001863
33,001830
34,001844
35,002657
36,001832
37,001833
38,001834
39,001836
40,001837
