stop_order,stop_id
1,940F276037968281
2,0FD6C16477F1F0E8
3,14157BA5C06B0B6B
4,605B05317A40A2A4
5,78AD2432201EF5EE
6,D9CE618F99BAC2B6
7,A010FE2C473103A8
8,70FEB409760C77EE
9,A1A1B10F5CE291AC
10,A11650027CA0992C
11,41D1C3067A2D555F
12,88F23AAD9EC3F5C6
13,86C5B251AF5F68BF
14,6A90A40248059768
15,A6F5C93F89B0969B
16,A131EEC027755D72
