stop_order,stop_id
1,002364
2,002262
3,002263
4,002170
5,002171
6,002172
7,002173
8,002160
9,002161
10,002162
11,002163
12,002227
13,002231
14,001113
15,001628
16,001777
17,001692
18,001595
19,001424
20,001585
21,001554
22,001555
23,001426
24,001429
25,002810
26,001687
27,002885
28,003604
29,003600
