route_id,route_seq,gen_date,shift_id,1,2,3,4,5,6,stop2_speed,stop3_speed,stop4_speed,stop5_speed,total_speed
2003472,1,2022-09-16,0,,2022-09-16 06:31:50.379000+08:00,2022-09-16 06:33:36.822000+08:00,2022-09-16 06:34:02.320000+08:00,2022-09-16 06:34:36.540000+08:00,2022-09-16 06:36:18.620000+08:00,6.867114755711608,6.017214012513575,4.955723793357775,4.643759719215297,5.696381534439114
2003472,1,2022-09-16,1,,2022-09-16 06:33:55.394000+08:00,2022-09-16 06:34:47.470000+08:00,2022-09-16 06:35:37.225000+08:00,2022-09-16 06:37:27.537000+08:00,2022-09-16 06:39:01.638000+08:00,14.036337198367974,3.083648334661263,1.5373202209070913,5.037512801537684,4.989495562948114
2003472,1,2022-09-16,2,,2022-09-16 06:35:54.394000+08:00,2022-09-16 06:36:32.857000+08:00,2022-09-16 06:36:45.371000+08:00,2022-09-16 06:40:41.442000+08:00,2022-09-16 06:42:02.277000+08:00,19.004141537119065,12.260422158468208,0.7183638321043374,5.8642295062472645,4.153502823396249
2003472,1,2022-09-16,3,,2022-09-16 06:40:39.586000+08:00,2022-09-16 06:41:28.267000+08:00,2022-09-16 06:42:14.382000+08:00,2022-09-16 06:42:42.646000+08:00,2022-09-16 06:44:22.193000+08:00,15.015227623553557,3.327050263278134,6.00003071782844,4.761921425432184,6.864128617606284
2003472,1,2022-09-16,4,,2022-09-16 06:42:11.742000+08:00,2022-09-16 06:43:39.399000+08:00,2022-09-16 06:44:32.784000+08:00,2022-09-16 06:44:59.385000+08:00,2022-09-16 06:46:50.290000+08:00,8.338824006550654,2.8739706451450995,6.375131318698659,4.274243651210473,5.485600611670097
2003472,1,2022-09-16,5,,2022-09-16 06:46:21.069000+08:00,2022-09-16 06:47:32.021000+08:00,2022-09-16 06:48:21.592000+08:00,2022-09-16 06:49:05.640000+08:00,2022-09-16 06:50:46.708000+08:00,10.30212391394479,3.095094367494526,3.8500015485085135,4.690257966294946,5.752179006770399
2003472,1,2022-09-16,6,,2022-09-16 06:49:11.318000+08:00,2022-09-16 06:50:34.935000+08:00,2022-09-16 06:51:14.740000+08:00,2022-09-16 06:51:49.972000+08:00,2022-09-16 06:53:44.555000+08:00,8.74171874071314,3.854463582240199,4.813376141255195,4.137044693693634,5.592226086435885
2003472,1,2022-09-16,7,,2022-09-16 07:01:14.066000+08:00,2022-09-16 07:02:56.385000+08:00,2022-09-16 07:03:18.917000+08:00,2022-09-16 07:04:09.118000+08:00,2022-09-16 07:05:45.542000+08:00,7.14389601092867,6.809290027120147,3.3781173324974207,4.9161514989784445,5.628501521974253
2003472,1,2022-09-16,8,,2022-09-16 07:06:04.280000+08:00,2022-09-16 07:07:37.785000+08:00,2022-09-16 07:08:19.492000+08:00,2022-09-16 07:08:46.307000+08:00,2022-09-16 07:10:28.201000+08:00,7.8172963578654695,3.6786851821294064,6.324253895532464,4.652236560911315,5.789622952245113
2003472,1,2022-09-16,9,,2022-09-16 07:09:04.982000+08:00,2022-09-16 07:10:53.761000+08:00,2022-09-16 07:11:20.587000+08:00,2022-09-16 07:11:56.213000+08:00,2022-09-16 07:13:05.788000+08:00,6.71964529865333,5.7193365723951075,4.760143384289649,6.813294892382285,6.345369630239621
2003472,1,2022-09-16,10,,2022-09-16 07:22:17.314000+08:00,2022-09-16 07:23:48.350000+08:00,2022-09-16 07:24:18.884000+08:00,2022-09-16 07:24:38.163000+08:00,2022-09-16 07:26:45.541000+08:00,8.029310338132284,5.024789509761942,8.796351896296645,3.721482454878375,5.6966788547740626
2003472,1,2022-09-16,11,,2022-09-16 07:24:52.365000+08:00,2022-09-16 07:26:11.393000+08:00,2022-09-16 07:26:54.707000+08:00,2022-09-16 07:27:24.617000+08:00,2022-09-16 07:29:18.643000+08:00,9.24933309639888,3.542201664382674,5.6698384556570725,4.157253539872464,5.738375228819061
2003472,1,2022-09-16,12,,2022-09-16 07:29:26.696000+08:00,2022-09-16 07:30:47.969000+08:00,2022-09-16 07:31:29.050000+08:00,2022-09-16 07:32:35.062000+08:00,2022-09-16 07:34:05.979000+08:00,8.993839232490627,3.734741678417544,2.5690006091120257,5.213931301489243,5.4711639418778875
2003472,1,2022-09-16,13,,2022-09-16 07:33:04.045000+08:00,2022-09-16 07:37:37.446000+08:00,2022-09-16 07:38:17.724000+08:00,2022-09-16 07:38:52.699000+08:00,2022-09-16 07:40:29.947000+08:00,2.673568479786872,3.8091991382658312,4.848745338347478,4.874496052746561,3.426768839743895
2003472,1,2022-09-16,14,,2022-09-16 07:37:19.984000+08:00,2022-09-16 07:40:43.653000+08:00,2022-09-16 07:41:27.578000+08:00,2022-09-16 07:42:00.729000+08:00,2022-09-16 07:43:39.816000+08:00,3.588942332619155,3.492929377144477,5.115527984335405,4.784028097908884,4.022839253089477
2003472,1,2022-09-16,15,,2022-09-16 07:39:20.023000+08:00,2022-09-16 07:40:43.653000+08:00,2022-09-16 07:43:03.250000+08:00,2022-09-16 07:43:47.232000+08:00,2022-09-16 07:45:41.471000+08:00,8.740359870168728,1.0990703445709515,3.8557789142991004,4.149502290264249,4.005796541545591
2003472,1,2022-09-16,16,,2022-09-16 07:42:26.298000+08:00,2022-09-16 07:44:35.101000+08:00,2022-09-16 07:45:23.475000+08:00,2022-09-16 07:45:54.319000+08:00,2022-09-16 07:48:13.884000+08:00,5.6749943397452745,3.171681541552717,5.498147717828525,3.396517695249508,4.396043221474634
2003472,1,2022-09-16,17,,2022-09-16 07:44:27.688000+08:00,2022-09-16 07:46:43.004000+08:00,2022-09-16 07:47:32.001000+08:00,2022-09-16 07:48:46.649000+08:00,2022-09-16 07:50:03.879000+08:00,5.4018467582710885,3.1313534071692377,2.2717938619749094,6.137964419752655,4.545044570436098
2003472,1,2022-09-16,18,,2022-09-16 07:48:36.602000+08:00,2022-09-16 07:51:02.508000+08:00,2022-09-16 07:51:35.183000+08:00,2022-09-16 07:52:40.342000+08:00,2022-09-16 07:54:08.995000+08:00,5.009775444068172,4.695544694447472,2.602631535301386,5.347083484343424,4.596977310531456
2003472,1,2022-09-16,19,,2022-09-16 08:03:30.699000+08:00,2022-09-16 08:06:06.405000+08:00,2022-09-16 08:06:39.920000+08:00,2022-09-16 08:07:32.260000+08:00,2022-09-16 08:09:27.961000+08:00,4.694464541778806,4.577858358677343,3.240062441893447,4.097069101714744,4.276981820567209
2003472,1,2022-09-16,20,,2022-09-16 08:07:41.364000+08:00,2022-09-16 08:09:59.562000+08:00,2022-09-16 08:11:11.180000+08:00,2022-09-16 08:12:09.804000+08:00,2022-09-16 08:13:59.847000+08:00,5.289195906903216,2.1422955526693173,2.8927549844552236,4.307725090532769,4.037177572518401
2003472,1,2022-09-16,21,,2022-09-16 08:21:43.227000+08:00,2022-09-16 08:23:46.413000+08:00,2022-09-16 08:24:21.238000+08:00,2022-09-16 08:24:53.706000+08:00,2022-09-16 08:26:46.822000+08:00,5.9337611087478335,4.405654641523937,5.223138727630375,4.1906979749769935,5.033031107822863
2003472,1,2022-09-16,22,,2022-09-16 08:26:08.965000+08:00,2022-09-16 08:28:12.309000+08:00,2022-09-16 08:29:11.941000+08:00,2022-09-16 08:30:37.794000+08:00,2022-09-16 08:32:05.568000+08:00,5.9261601370331,2.572895809147289,1.9752934458749611,5.400631076827962,4.284885654858434
2003472,1,2022-09-16,23,,2022-09-16 08:30:08.462000+08:00,2022-09-16 08:31:18.451000+08:00,2022-09-16 08:32:12.671000+08:00,2022-09-16 08:32:56.065000+08:00,2022-09-16 08:35:10.327000+08:00,10.443873979371196,2.829710861141113,3.9080257226506667,3.530671315320028,5.061875603927193
2003472,1,2022-09-16,24,,2022-09-16 08:34:14.273000+08:00,2022-09-16 08:35:36.545000+08:00,2022-09-16 08:36:06.523000+08:00,2022-09-16 08:36:56.646000+08:00,2022-09-16 08:39:04.264000+08:00,8.884630201553513,5.117983951266634,3.3833742634858854,3.7144837886308952,5.269139660125599
2003472,1,2022-09-16,25,,2022-09-16 08:37:48.666000+08:00,2022-09-16 08:38:47.922000+08:00,2022-09-16 08:41:16.502000+08:00,2022-09-16 08:41:59.156000+08:00,2022-09-16 08:42:34.577000+08:00,12.335565950152064,1.032621637441588,3.9758256718878187,13.382879990330526,5.344331205093481
2003472,1,2022-09-16,26,,2022-09-16 08:50:09.976000+08:00,2022-09-16 08:50:54.350000+08:00,2022-09-16 08:51:51.627000+08:00,2022-09-16 08:52:53.517000+08:00,2022-09-16 08:54:29.363000+08:00,16.472625770546053,2.6786829423864926,2.740101279830393,4.945798386343692,5.890823669572809
2003472,1,2022-09-16,27,,2022-09-16 08:52:54.949000+08:00,2022-09-16 08:53:43.926000+08:00,2022-09-16 08:55:51.863000+08:00,2022-09-16 08:56:31.382000+08:00,2022-09-16 08:57:50.801000+08:00,14.92448079592892,1.1992380850814943,4.291223669847492,5.968785707922507,5.164754942266682
2003472,1,2022-09-16,28,,2022-09-16 08:57:12.883000+08:00,2022-09-16 09:00:00.697000+08:00,2022-09-16 09:01:10.551000+08:00,2022-09-16 09:02:06.949000+08:00,2022-09-16 09:04:19.852000+08:00,4.355752773560076,2.196394234991141,3.0069305331519387,3.56677420477715,3.57872135724018
2003472,1,2022-09-16,29,,2022-09-16 09:05:09.589000+08:00,2022-09-16 09:07:17.245000+08:00,2022-09-16 09:08:18.487000+08:00,2022-09-16 09:09:20.949000+08:00,2022-09-16 09:11:03.774000+08:00,5.725984645784065,2.50525657050833,2.7150086165781278,4.6101141953561635,4.314138315229279
2003472,1,2022-09-16,30,,2022-09-16 09:10:38.362000+08:00,2022-09-16 09:13:12.265000+08:00,2022-09-16 09:14:10.887000+08:00,2022-09-16 09:14:40.467000+08:00,2022-09-16 09:16:29.506000+08:00,4.749460997785688,2.6172242995986346,5.733092231531543,4.347389394047061,4.351499895141259
2003472,1,2022-09-16,31,,2022-09-16 09:15:12.787000+08:00,2022-09-16 09:17:56.672000+08:00,2022-09-16 09:18:55.322000+08:00,2022-09-16 09:20:47.578000+08:00,2022-09-16 09:22:35.905000+08:00,4.460178148959397,2.615974814852023,1.5106975859526708,4.3759634452860094,3.4482983746529867
2003472,1,2022-09-16,32,,2022-09-16 09:17:24.837000+08:00,2022-09-16 09:19:19.584000+08:00,2022-09-16 09:20:04.365000+08:00,2022-09-16 09:23:24.671000+08:00,2022-09-16 09:24:47.468000+08:00,6.370156047149037,3.4261611596675188,0.8466289986755415,5.72526772875222,3.4520923278746456
2003472,1,2022-09-16,33,,2022-09-16 09:23:17.791000+08:00,2022-09-16 09:25:17.041000+08:00,2022-09-16 09:26:17.082000+08:00,2022-09-16 09:26:47.650000+08:00,2022-09-16 09:28:24.521000+08:00,6.129612544588769,2.5553692125559393,5.5477907684082375,4.893466487777535,4.981589929838888
2003472,1,2022-09-16,34,,2022-09-16 09:29:22.607000+08:00,2022-09-16 09:31:16.398000+08:00,2022-09-16 09:32:13.220000+08:00,2022-09-16 09:33:06.713000+08:00,2022-09-16 09:34:49+08:00,6.423674068618877,2.7001323939859763,3.1702254165723183,4.634362061039013,4.681482382218621
2003472,1,2022-09-16,35,,2022-09-16 09:35:50.165000+08:00,2022-09-16 09:37:47.973000+08:00,2022-09-16 09:38:18.728000+08:00,2022-09-16 09:40:51.478000+08:00,2022-09-16 09:42:25.965000+08:00,6.204640567212843,4.9886822595048335,1.110211903166632,5.016933463201261,3.860543403687423
2003472,1,2022-09-16,36,,2022-09-16 09:43:21.723000+08:00,2022-09-16 09:44:51.244000+08:00,2022-09-16 09:46:10.199000+08:00,2022-09-16 09:46:55.734000+08:00,2022-09-16 09:48:35.900000+08:00,8.165193596387558,1.9432198453685154,3.7242751336049857,4.732493981365908,4.8635103116379685
2003472,1,2022-09-16,37,,2022-09-16 09:47:55.514000+08:00,2022-09-16 09:49:49.222000+08:00,2022-09-16 09:50:34.204000+08:00,2022-09-16 09:51:14.871000+08:00,2022-09-16 09:52:55.840000+08:00,6.428362964278772,3.4108515159635218,4.170085529021148,4.694856759376616,5.087814838473799
2003472,1,2022-09-16,38,,2022-09-16 09:57:05.999000+08:00,2022-09-16 09:58:02.980000+08:00,2022-09-16 09:59:05.786000+08:00,2022-09-16 09:59:16.416000+08:00,2022-09-16 10:00:13.346000+08:00,12.82807068921589,2.4428704724241497,15.953421280216654,8.326629055638461,8.156005055749397
2003472,1,2022-09-16,39,,2022-09-16 09:59:31.080000+08:00,2022-09-16 10:00:11.311000+08:00,2022-09-16 10:00:49.796000+08:00,2022-09-16 10:03:01.332000+08:00,2022-09-16 10:04:50.175000+08:00,18.168981530218254,3.9866681276100073,1.2892658147480767,4.355217994152105,4.788552246758746
2003472,1,2022-09-16,40,,2022-09-16 10:06:04.228000+08:00,2022-09-16 10:07:35.514000+08:00,2022-09-16 10:08:06.897000+08:00,2022-09-16 10:09:34.896000+08:00,2022-09-16 10:12:20.161000+08:00,8.00732090290089,4.888854567475103,1.9271226742201963,2.8683326302453493,4.064562246941563
2003472,1,2022-09-16,41,,2022-09-16 10:12:44.883000+08:00,2022-09-16 10:15:06.970000+08:00,2022-09-16 10:15:39.836000+08:00,2022-09-16 10:16:31.741000+08:00,2022-09-16 10:18:25.728000+08:00,5.1444276812249585,4.668256644893542,3.2672164186244683,4.158675920390023,4.482985166804507
2003472,1,2022-09-16,42,,2022-09-16 10:18:42.916000+08:00,2022-09-16 10:21:02.589000+08:00,2022-09-16 10:21:31.402000+08:00,2022-09-16 10:23:02.798000+08:00,2022-09-16 10:25:02.687000+08:00,5.2333399865558174,5.324920101727385,1.855495516310375,3.95394900397449,4.023485414050789
2003472,1,2022-09-16,43,,2022-09-16 10:27:53.562000+08:00,2022-09-16 10:29:51.176000+08:00,2022-09-16 10:31:09.636000+08:00,2022-09-16 10:32:21.259000+08:00,2022-09-16 10:33:50.719000+08:00,6.214874895354385,1.9554795168375114,2.3677431580456423,5.298848559551728,4.278239203430094
2003472,1,2022-09-16,44,,2022-09-16 10:33:09.155000+08:00,2022-09-16 10:34:54.589000+08:00,2022-09-16 10:35:35.070000+08:00,2022-09-16 10:36:50.149000+08:00,2022-09-16 10:38:21.201000+08:00,6.932832823778009,3.7900971539999295,2.2587523569667023,5.206200765908465,4.896723813730931
2003472,1,2022-09-16,45,,2022-09-16 10:43:56.566000+08:00,2022-09-16 10:48:04.671000+08:00,2022-09-16 10:48:55.128000+08:00,2022-09-16 10:50:08.045000+08:00,2022-09-16 10:51:46.079000+08:00,2.9461570542399818,3.0407460390247367,2.3257247035492825,4.835414163835991,3.254442537649612
2003472,1,2022-09-16,46,,2022-09-16 10:50:21.151000+08:00,2022-09-16 10:52:47.087000+08:00,2022-09-16 10:53:44.345000+08:00,2022-09-16 10:55:17.265000+08:00,2022-09-16 10:57:20.683000+08:00,5.008745586710686,2.6795718133897646,1.8250631533437691,3.840890244028404,3.642160977421227
2003472,1,2022-09-16,47,,2022-09-16 10:56:01.030000+08:00,2022-09-16 10:57:57.202000+08:00,2022-09-16 10:59:08.396000+08:00,2022-09-16 11:00:45.674000+08:00,2022-09-16 11:02:34.537000+08:00,6.292017835125596,2.155054118199162,1.7433013446894776,4.3544178659186095,3.8830391306367664
2003472,1,2022-09-16,48,,2022-09-16 11:02:38.133000+08:00,2022-09-16 11:04:44.608000+08:00,2022-09-16 11:07:03.729000+08:00,2022-09-16 11:08:13.969000+08:00,2022-09-16 11:09:54.661000+08:00,5.779452824211984,1.1028307939927915,2.414363157868779,4.707772138178779,3.50035525597323
2003472,1,2022-09-16,49,,2022-09-16 11:15:40.585000+08:00,2022-09-16 11:17:25.771000+08:00,2022-09-16 11:18:35.592000+08:00,2022-09-16 11:19:23.932000+08:00,2022-09-16 11:21:22.575000+08:00,6.949178559334993,2.197432332551398,3.508168560378631,3.995473750136945,4.467975903328992
2003472,1,2022-09-16,50,,2022-09-16 11:19:41.549000+08:00,2022-09-16 11:21:22.439000+08:00,2022-09-16 11:22:32.236000+08:00,2022-09-16 11:24:02.311000+08:00,2022-09-16 11:26:17.062000+08:00,7.245081732007242,2.1981879291527022,1.88270739060453,3.517858807263008,3.8633447678824266
2003472,1,2022-09-16,51,,2022-09-16 11:30:04.771000+08:00,2022-09-16 11:31:22.105000+08:00,2022-09-16 11:33:10.170000+08:00,2022-09-16 11:34:29.813000+08:00,2022-09-16 11:36:29.260000+08:00,9.45193958598043,1.4197651681031893,2.1293129114762506,3.9685801412969566,3.9741138996940935
2003472,1,2022-09-16,52,,2022-09-16 11:34:30.636000+08:00,2022-09-16 11:36:29.607000+08:00,2022-09-16 11:37:28.415000+08:00,2022-09-16 11:38:32.819000+08:00,2022-09-16 11:50:22.951000+08:00,6.143987156048202,2.6089464510112763,2.633141857783725,0.6675308141831344,1.6045143457568998
2003472,1,2022-09-16,53,,2022-09-16 11:41:54.138000+08:00,2022-09-16 11:43:59.333000+08:00,2022-09-16 11:44:59.442000+08:00,2022-09-16 11:45:49.843000+08:00,2022-09-16 11:51:18.932000+08:00,5.838542241640726,2.552478379129101,3.3647123709589692,1.4404461775917687,2.705416628327288
2003472,1,2022-09-16,54,,2022-09-16 11:44:36.651000+08:00,2022-09-16 11:46:19.240000+08:00,2022-09-16 11:52:35.967000+08:00,2022-09-16 11:53:37.737000+08:00,2022-09-16 11:56:23.543000+08:00,7.125094268802802,0.40726287972741837,2.7454244489024284,2.858973692975511,2.1615792499837063
2003472,1,2022-09-16,55,,2022-09-16 11:54:25.675000+08:00,2022-09-16 11:56:19.275000+08:00,2022-09-16 11:57:14.184000+08:00,2022-09-16 11:58:09.263000+08:00,2022-09-16 12:00:22.127000+08:00,6.434474436111009,2.794203552988966,3.07893876447835,3.5678211715551056,4.2867008157605575
2003472,1,2022-09-16,56,,2022-09-16 12:08:41.066000+08:00,2022-09-16 12:10:16.677000+08:00,2022-09-16 12:11:35.941000+08:00,2022-09-16 12:12:22.457000+08:00,2022-09-16 12:14:15.571000+08:00,7.645106692140137,1.9356444652183988,3.6457319676821536,4.19077207186995,4.56795288315416
2003472,1,2022-09-16,57,,2022-09-16 12:12:14.629000+08:00,2022-09-16 12:14:00.692000+08:00,2022-09-16 12:15:34.885000+08:00,2022-09-16 12:16:30.154000+08:00,2022-09-16 12:18:09.087000+08:00,6.891718091532492,1.6288569521203395,3.068354198713619,4.791474959189528,4.310815609125713
2003472,1,2022-09-16,58,,2022-09-16 12:18:32.388000+08:00,2022-09-16 12:20:03.634000+08:00,2022-09-16 12:21:46.742000+08:00,2022-09-16 12:22:30.056000+08:00,2022-09-16 12:24:24.738000+08:00,8.010831115251197,1.488021520067028,3.9152437597244085,4.133473362319262,4.336605872511656
2003472,1,2022-09-16,59,,2022-09-16 12:22:35.374000+08:00,2022-09-16 12:24:02.104000+08:00,2022-09-16 12:25:05.572000+08:00,2022-09-16 12:26:13.256000+08:00,2022-09-16 12:28:13.929000+08:00,8.427952218865567,2.4173902264301876,2.5055385055360655,3.9282606062457845,4.51330826358932
2003472,1,2022-09-16,60,,2022-09-16 12:35:34.942000+08:00,2022-09-16 12:37:51.308000+08:00,2022-09-16 12:38:39.450000+08:00,2022-09-16 12:39:19.910000+08:00,2022-09-16 12:40:59.248000+08:00,5.360253259186385,3.1869661187958775,4.191420370951632,4.771940165269057,4.711609033380457
2003472,1,2022-09-16,61,,2022-09-16 12:41:04.227000+08:00,2022-09-16 12:42:42.129000+08:00,2022-09-16 12:43:13.996000+08:00,2022-09-16 12:44:11.967000+08:00,2022-09-16 12:45:55.556000+08:00,7.466203917613641,4.814602030033299,2.9253397079350543,4.576113217981615,5.244939841826533
2003472,1,2022-09-16,62,,2022-09-16 12:45:53.117000+08:00,2022-09-16 12:49:21.269000+08:00,2022-09-16 12:51:10.583000+08:00,2022-09-16 12:52:10.973000+08:00,2022-09-16 12:54:01.705000+08:00,3.511646757860653,1.403543213962266,2.808161420909141,4.280921433167445,3.1273856074637165
2003472,1,2022-09-16,63,,2022-09-16 12:49:44.372000+08:00,2022-09-16 12:52:02.308000+08:00,2022-09-16 12:52:56.368000+08:00,2022-09-16 12:54:24.362000+08:00,2022-09-16 12:56:29.890000+08:00,5.299242372855604,2.838085884037572,1.9272321772928043,3.7763287245674078,3.768027755067549
2003472,1,2022-09-16,64,,2022-09-16 12:55:10.317000+08:00,2022-09-16 12:58:02.702000+08:00,2022-09-16 12:59:33.496000+08:00,2022-09-16 13:02:01.849000+08:00,2022-09-16 13:03:14.566000+08:00,4.2402546389895335,1.689835483523924,1.143117215079594,6.518901936789163,3.155407815358384
2003472,1,2022-09-16,65,,2022-09-16 13:02:27.137000+08:00,2022-09-16 13:05:14.951000+08:00,2022-09-16 13:06:10.615000+08:00,2022-09-16 13:08:36.849000+08:00,2022-09-16 13:12:03.277000+08:00,4.355752773560076,2.7563043060339023,1.15968152555974,2.2963696404436296,2.6521385065773635
2003472,1,2022-09-16,66,,2022-09-16 13:12:03.962000+08:00,2022-09-16 13:13:50.072000+08:00,2022-09-16 13:15:19.668000+08:00,2022-09-16 13:16:38.160000+08:00,2022-09-16 13:19:15.775000+08:00,6.888665497523426,1.7124304979136473,2.1605369745796135,3.0075499929416463,3.53857590943182
2003472,1,2022-09-16,67,,2022-09-16 13:16:01.350000+08:00,2022-09-16 13:17:34.990000+08:00,2022-09-16 13:18:42.205000+08:00,2022-09-16 13:19:22.219000+08:00,2022-09-16 13:22:16.176000+08:00,7.806026227490502,2.2826292180476253,4.238138356792698,2.7250124578918786,4.076566404623698
2003472,1,2022-09-16,68,,2022-09-16 13:31:58.332000+08:00,2022-09-16 13:34:01.008000+08:00,2022-09-16 13:35:16.905000+08:00,2022-09-16 13:36:32.199000+08:00,2022-09-16 13:38:47.373000+08:00,5.958429488589542,2.0215149859819377,2.252302550119572,3.5068503716505948,3.7355743780684145
2003472,1,2022-09-16,69,,2022-09-16 13:36:10.854000+08:00,2022-09-16 13:37:35.917000+08:00,2022-09-16 13:38:35.899000+08:00,2022-09-16 13:39:11.527000+08:00,2022-09-16 13:40:36.116000+08:00,8.593116818619267,2.557882746341755,4.759876170672028,5.603979147850164,5.760354212738659
2003472,1,2022-09-16,70,,2022-09-16 13:42:31.713000+08:00,2022-09-16 13:44:29.798000+08:00,2022-09-16 13:46:16.260000+08:00,2022-09-16 13:47:20.776000+08:00,2022-09-16 13:50:08.480000+08:00,6.1900859206691,1.4411425944569063,2.6285707143763255,2.826617088068845,3.345257164329915
2003472,1,2022-09-16,71,,2022-09-16 13:50:54.971000+08:00,2022-09-16 13:52:44.250000+08:00,2022-09-16 13:53:10.860000+08:00,2022-09-16 13:54:10.267000+08:00,2022-09-16 13:56:14.267000+08:00,6.688899934499864,5.765761852351415,2.854627707319054,3.8228628398185287,4.78553780560822
2003472,1,2022-09-16,72,,2022-09-16 13:53:01.495000+08:00,2022-09-16 13:55:03.582000+08:00,2022-09-16 13:56:22.200000+08:00,2022-09-16 13:57:18.647000+08:00,2022-09-16 13:59:37.662000+08:00,5.987175505518284,1.9515495546957586,3.0043203041561646,3.4099557036111037,3.856967085041113
2003472,1,2022-09-16,73,,2022-09-16 13:55:35.078000+08:00,2022-09-16 13:57:40.650000+08:00,2022-09-16 13:58:11.339000+08:00,2022-09-16 13:59:25.677000+08:00,2022-09-16 14:01:30.563000+08:00,5.821013410172735,4.999410958032883,2.2812675644852303,3.7957416534879616,4.298361616325534
2003472,1,2022-09-16,74,,2022-09-16 14:02:15.433000+08:00,2022-09-16 14:04:08.201000+08:00,2022-09-16 14:06:39.727000+08:00,2022-09-16 14:08:07.371000+08:00,2022-09-16 14:10:32.742000+08:00,6.481947857035779,1.0125451928452618,1.934928440152241,3.260863529435015,3.0725425825381847
2003472,1,2022-09-16,75,,2022-09-16 14:06:12.927000+08:00,2022-09-16 14:08:02.003000+08:00,2022-09-16 14:09:00.519000+08:00,2022-09-16 14:09:52.119000+08:00,2022-09-16 14:12:33.466000+08:00,6.701348563773981,2.6219653238613567,3.286528453657035,2.9379845434839047,4.015365256069633
2003472,1,2022-09-16,76,,2022-09-16 14:08:27.693000+08:00,2022-09-16 14:10:28.796000+08:00,2022-09-16 14:11:02.822000+08:00,2022-09-16 14:12:31.027000+08:00,2022-09-16 14:14:41.163000+08:00,6.035823191351252,4.509108413891469,1.9226219398979993,3.6426122835917627,4.091367657856005
2003472,1,2022-09-16,77,,2022-09-16 14:14:14.194000+08:00,2022-09-16 14:17:18.591000+08:00,2022-09-16 14:19:13.063000+08:00,2022-09-16 14:20:50.639000+08:00,2022-09-16 14:23:12.298000+08:00,3.9640357269489774,1.3403008848545597,1.7379772506426072,3.34631045071261,2.839605502243957
2003472,1,2022-09-16,78,,2022-09-16 14:23:18.839000+08:00,2022-09-16 14:25:31.800000+08:00,2022-09-16 14:26:30.348000+08:00,2022-09-16 14:27:37.091000+08:00,2022-09-16 14:29:27.042000+08:00,5.49752405549154,2.6205322622646574,2.5408637341549385,4.311329520763773,4.149893073058836
2003472,1,2022-09-16,79,,2022-09-16 14:34:48.495000+08:00,2022-09-16 14:36:42.619000+08:00,2022-09-16 14:37:26.436000+08:00,2022-09-16 14:38:18.867000+08:00,2022-09-16 14:40:42.116000+08:00,6.404930566245581,3.5015387381854333,3.234438942776278,3.3091678974198606,4.321019054805801
2003472,1,2022-09-16,80,,2022-09-16 14:43:12.884000+08:00,2022-09-16 14:44:59.444000+08:00,2022-09-16 14:45:58.964000+08:00,2022-09-16 14:46:59.968000+08:00,2022-09-16 14:48:59.112000+08:00,6.859574849307532,2.5777372797558993,2.7798975183381915,3.9786728004557306,4.413285693760996
2003472,1,2022-09-16,81,,2022-09-16 14:54:09.163000+08:00,2022-09-16 14:56:30.514000+08:00,2022-09-16 14:57:47.687000+08:00,2022-09-16 14:58:51.411000+08:00,2022-09-16 15:01:01.567000+08:00,5.171214182723933,1.988090690929096,2.661240163968097,3.642052553378235,3.70511216957033
2003472,1,2022-09-16,82,,2022-09-16 15:01:16.785000+08:00,2022-09-16 15:03:48.404000+08:00,2022-09-16 15:05:05.544000+08:00,2022-09-16 15:07:32.067000+08:00,2022-09-16 15:09:35.715000+08:00,4.821007234859818,1.9889411834466055,1.15739418527264,3.833745730925673,3.062560036837797
2003472,1,2022-09-16,83,,2022-09-16 15:02:21.255000+08:00,2022-09-16 15:03:48.404000+08:00,2022-09-16 15:08:37.848000+08:00,2022-09-16 15:10:28.668000+08:00,2022-09-16 15:12:20.798000+08:00,8.387431822995223,0.5300746358227192,1.5302731294775584,4.227548311223559,2.548612992194859
2003472,1,2022-09-16,84,,2022-09-16 15:14:11.179000+08:00,2022-09-16 15:16:49.920000+08:00,2022-09-16 15:18:21.290000+08:00,2022-09-16 15:19:32.373000+08:00,2022-09-16 15:21:34.695000+08:00,4.604710162731813,1.6791826955354179,2.3857303182013,3.8753044598477584,3.445203959224655
2003472,1,2022-09-16,85,,2022-09-16 15:17:43.110000+08:00,2022-09-16 15:19:23.819000+08:00,2022-09-16 15:20:49.768000+08:00,2022-09-16 15:22:24.809000+08:00,2022-09-16 15:23:41.536000+08:00,7.258103009087675,1.7850925885242543,1.784333794980093,6.1782031375851725,4.263092184103503
2003472,1,2022-09-16,86,,2022-09-16 15:21:10.622000+08:00,2022-09-16 15:23:37.716000+08:00,2022-09-16 15:24:01.479000+08:00,2022-09-16 15:28:02.529000+08:00,2022-09-16 15:29:31.002000+08:00,4.969314152461764,6.45654685397766,0.703525692631002,5.357962227317912,3.053685357487274
2003472,1,2022-09-16,87,,2022-09-16 15:28:10.169000+08:00,2022-09-16 15:30:06.056000+08:00,2022-09-16 15:31:18.131000+08:00,2022-09-16 15:32:32.110000+08:00,2022-09-16 15:33:28.904000+08:00,6.3074917457714035,2.1287120761855167,2.2923379365590644,8.34656816102929,4.793960748519875
2003472,1,2022-09-16,88,,2022-09-16 15:31:09.291000+08:00,2022-09-16 15:33:09.300000+08:00,2022-09-16 15:33:58.291000+08:00,2022-09-16 15:35:04.054000+08:00,2022-09-16 15:36:28.183000+08:00,6.090845652761132,3.1317369086377327,2.578727676789426,5.634620548651446,4.79160053930322
2003472,1,2022-09-16,89,,2022-09-16 15:39:28.217000+08:00,2022-09-16 15:40:34.374000+08:00,2022-09-16 15:41:32.516000+08:00,2022-09-16 15:42:20.514000+08:00,2022-09-16 15:46:01.220000+08:00,11.048812611548447,2.6388311872840826,3.5331653029022676,2.147811985797838,3.888018867997146
2003472,1,2022-09-16,90,,2022-09-16 15:45:27.662000+08:00,2022-09-16 15:46:24.503000+08:00,2022-09-16 15:47:18.530000+08:00,2022-09-16 15:48:18.859000+08:00,2022-09-16 15:51:51.147000+08:00,12.859666366570094,2.8398194030960657,2.8110008156724464,2.232980630735122,3.984518505755068
2003472,1,2022-09-16,91,,2022-09-16 15:49:38.742000+08:00,2022-09-16 15:52:29.401000+08:00,2022-09-16 15:53:48.115000+08:00,2022-09-16 15:54:23.931000+08:00,2022-09-16 15:57:03.926000+08:00,4.283139453191515,1.9491694348028452,4.734891339309331,2.962811288712132,3.432295588294912
2003472,1,2022-09-16,92,,2022-09-16 15:55:23.774000+08:00,2022-09-16 15:57:08.411000+08:00,2022-09-16 15:58:32.962000+08:00,2022-09-16 15:59:16.490000+08:00,2022-09-16 16:01:52.616000+08:00,6.985638884354585,1.8146080222714238,3.8959949505767097,3.036233504589226,3.9296245754817694
2003472,1,2022-09-16,93,,2022-09-16 15:57:57.321000+08:00,2022-09-16 15:59:05.801000+08:00,2022-09-16 16:00:18.810000+08:00,2022-09-16 16:01:25.363000+08:00,2022-09-16 16:03:31.101000+08:00,10.674011330931814,2.1014795832167423,2.5481175635764433,3.7700217288130684,4.57787488519229
2003472,1,2022-09-16,94,,2022-09-16 16:03:27.174000+08:00,2022-09-16 16:05:15.046000+08:00,2022-09-16 16:06:00.524000+08:00,2022-09-16 16:06:48.121000+08:00,2022-09-16 16:09:05.517000+08:00,6.776144837791184,3.3736514994298594,3.5629318698384984,3.450136773541425,4.516136226194963
2003472,1,2022-09-16,95,,2022-09-16 16:06:56.452000+08:00,2022-09-16 16:09:25.962000+08:00,2022-09-16 16:10:12.564000+08:00,2022-09-16 16:11:23.652000+08:00,2022-09-16 16:13:16.278000+08:00,4.889012747924625,3.292281938351812,2.3855625170029127,4.2089303725382905,4.022902800702117
2003472,1,2022-09-16,96,,2022-09-16 16:18:53.918000+08:00,2022-09-16 16:20:30.483000+08:00,2022-09-16 16:20:49.012000+08:00,2022-09-16 16:21:14.913000+08:00,2022-09-16 16:23:16.023000+08:00,7.569577962431633,8.280367148311896,6.547425512864486,3.9140863028445017,5.829736476524607
2003472,1,2022-09-16,97,,2022-09-16 16:26:17.860000+08:00,2022-09-16 16:27:41.502000+08:00,2022-09-16 16:29:00.305000+08:00,2022-09-16 16:30:26.136000+08:00,2022-09-16 16:32:34.216000+08:00,8.739105903041661,1.9469680455194742,1.9757997484440708,3.701085197825558,4.059993939725904
2003472,1,2022-09-16,98,,2022-09-16 16:36:28.814000+08:00,2022-09-16 16:38:55.142000+08:00,2022-09-16 16:45:14.114000+08:00,2022-09-16 16:40:15.877000+08:00,2022-09-16 16:42:05.792000+08:00,4.995327592410274,0.40485028680501767,-0.5686245107371085,4.312741592480531,4.534429782298792
2003472,1,2022-09-16,99,,2022-09-16 16:41:53.671000+08:00,2022-09-16 16:44:25.140000+08:00,2022-09-16 16:45:26.724000+08:00,2022-09-16 16:46:21.514000+08:00,2022-09-16 16:48:43.586000+08:00,4.825781486259305,2.4913439024920616,3.09517919709259,3.3365828040535614,3.727609575593677
2003472,1,2022-09-16,100,,2022-09-16 16:46:31.042000+08:00,2022-09-16 16:48:18.905000+08:00,2022-09-16 16:49:20.674000+08:00,2022-09-16 16:50:12.937000+08:00,2022-09-16 16:52:56.713000+08:00,6.776710233742902,2.4838822530892704,3.244836083054992,2.8944106104526766,3.9619340815863318
2003472,1,2022-09-16,101,,2022-09-16 16:48:39.128000+08:00,2022-09-16 16:50:25.600000+08:00,2022-09-16 16:51:08.146000+08:00,2022-09-16 16:52:01.461000+08:00,2022-09-16 16:54:17.532000+08:00,6.86524434538856,3.606142125959459,3.180809682241452,3.4837326993811875,4.515322156887868
2003472,1,2022-09-16,102,,2022-09-16 17:00:21.326000+08:00,2022-09-16 17:03:25.450000+08:00,2022-09-16 17:04:40.150000+08:00,2022-09-16 17:06:00.047000+08:00,2022-09-16 17:28:31.099000+08:00,3.9699131886240284,2.0539079369621303,2.1225436275292315,0.3508636174902947,0.9042652943202918
2003472,1,2022-09-16,103,,2022-09-16 17:22:53.369000+08:00,2022-09-16 17:24:58.009000+08:00,2022-09-16 17:26:16.952000+08:00,2022-09-16 17:27:05.874000+08:00,2022-09-16 17:34:10.053000+08:00,5.864540243438789,1.9435152311296904,3.466433674189588,1.1175352672751306,2.258074787019469
2003472,1,2022-09-16,104,,2022-09-16 17:31:16.264000+08:00,2022-09-16 17:33:47.719000+08:00,2022-09-16 17:35:08.329000+08:00,2022-09-16 17:35:30.291000+08:00,2022-09-16 17:37:12.406000+08:00,4.826227565562117,1.903323692979421,7.721740652431611,4.64216806676294,4.2904321287000196
2003472,1,2022-09-16,105,,2022-09-16 17:43:48.653000+08:00,2022-09-16 17:45:20.648000+08:00,2022-09-16 17:45:38.055000+08:00,2022-09-16 17:46:38.923000+08:00,2022-09-16 17:47:55.260000+08:00,7.945608956380353,8.814093346990932,2.786108763368322,6.209767113424651,6.196105865524832
2003472,1,2022-09-16,106,,2022-09-16 17:48:52.799000+08:00,2022-09-16 17:51:16.604000+08:00,2022-09-16 17:52:23.578000+08:00,2022-09-16 17:53:09.769000+08:00,2022-09-16 17:54:53.798000+08:00,5.082968575099688,2.2908430568738782,3.6713833475937525,4.55675813607261,4.232707235143261
2003472,1,2022-09-16,107,,2022-09-16 17:53:01.581000+08:00,2022-09-16 17:54:37.988000+08:00,2022-09-16 17:55:19.736000+08:00,2022-09-16 17:56:31.666000+08:00,2022-09-16 17:58:53.882000+08:00,7.581983631294519,3.6750724080452035,2.3576375393952875,3.3332043661577986,4.33720903199106
2003472,1,2022-09-16,108,,2022-09-16 18:07:00.286000+08:00,2022-09-16 18:09:22.014000+08:00,2022-09-16 18:09:47.014000+08:00,2022-09-16 18:10:32.312000+08:00,2022-09-16 18:12:30.893000+08:00,5.157458624564028,6.1370769156428455,3.743760612139676,3.9975627810315104,4.621811029952427
2003472,1,2022-09-16,109,,2022-09-16 18:13:46.809000+08:00,2022-09-16 18:16:39.274000+08:00,2022-09-16 18:17:06.795000+08:00,2022-09-16 18:18:24.866000+08:00,2022-09-16 18:19:54.902000+08:00,4.2382877450045555,5.574903633264458,2.1721877292298424,5.264949488399058,4.151133216821516
2003472,1,2022-09-16,110,,2022-09-16 18:18:35.700000+08:00,2022-09-16 18:20:16.741000+08:00,2022-09-16 18:21:17.698000+08:00,2022-09-16 18:22:12.387000+08:00,2022-09-16 18:23:41.824000+08:00,7.23425437141567,2.5169697145704535,3.1008953941140454,5.300211234025041,4.9914514352990365
2003472,1,2022-09-16,111,,2022-09-16 18:22:10.016000+08:00,2022-09-16 18:24:45.217000+08:00,2022-09-16 18:25:48.786000+08:00,2022-09-16 18:26:47.779000+08:00,2022-09-16 18:28:28.768000+08:00,4.709739601820933,2.4135494170282863,2.8746608616056655,4.693926983508081,4.034310258901556
2003472,1,2022-09-16,112,,2022-09-16 18:29:20.733000+08:00,2022-09-16 18:31:40.919000+08:00,2022-09-16 18:32:16.407000+08:00,2022-09-16 18:33:05.967000+08:00,2022-09-16 18:35:14.116000+08:00,5.214188977089086,4.323346564784466,3.4218092858898914,3.6990924013257818,4.323929218947947
2003472,1,2022-09-16,113,,2022-09-16 18:31:15.528000+08:00,2022-09-16 18:33:11.409000+08:00,2022-09-16 18:34:11.204000+08:00,2022-09-16 18:35:02.318000+08:00,2022-09-16 18:36:54.334000+08:00,6.307818330375218,2.5658821455150287,3.3177772862367068,4.23185073683668,4.509964638109958
2003472,1,2022-09-16,114,,2022-09-16 18:35:23.150000+08:00,2022-09-16 18:37:34.327000+08:00,2022-09-16 18:38:09.806000+08:00,2022-09-16 18:39:02.515000+08:00,2022-09-16 18:41:00.302000+08:00,5.5722900808999345,4.324443273234058,3.217379730381966,4.024510278192819,4.532089618864733
2003472,1,2022-09-16,115,,2022-09-16 18:41:01.099000+08:00,2022-09-16 18:42:27.767000+08:00,2022-09-16 18:43:20.247000+08:00,2022-09-16 18:44:12.074000+08:00,2022-09-16 18:45:45.351000+08:00,8.433981353466223,2.9235313050890084,3.2721336023443968,5.082013702600829,5.375522702318654
2003472,1,2022-09-16,116,,2022-09-16 18:45:32.864000+08:00,2022-09-16 18:46:34.546000+08:00,2022-09-16 18:47:26.065000+08:00,2022-09-16 18:48:21.156000+08:00,2022-09-16 18:49:23.901000+08:00,11.850398753967294,2.978064847746873,3.078268105656151,7.554944491792136,6.613672611657363
2003472,1,2022-09-16,117,,2022-09-16 18:48:57.438000+08:00,2022-09-16 18:50:20.282000+08:00,2022-09-16 18:51:02.302000+08:00,2022-09-16 18:52:08.950000+08:00,2022-09-16 18:53:58.587000+08:00,8.823285886029293,3.6512832672791795,2.544485479064684,4.323677154040128,5.073910519973443
2003472,1,2022-09-16,118,,2022-09-16 18:54:50.365000+08:00,2022-09-16 18:57:21.572000+08:00,2022-09-16 18:58:39.071000+08:00,2022-09-16 18:59:18.161000+08:00,2022-09-16 19:01:07.198000+08:00,4.834143233727345,1.9797277757270564,4.33831844995403,4.347469135591566,4.054854747804683
2003472,1,2022-09-16,119,,2022-09-16 19:05:02.027000+08:00,2022-09-16 19:06:22.922000+08:00,2022-09-16 19:07:06.685000+08:00,2022-09-16 19:07:37.554000+08:00,2022-09-16 19:09:22.024000+08:00,9.035864960037218,3.5058593535879887,5.493694911033821,4.537522658538313,5.877002731491064
2003472,1,2022-09-16,120,,2022-09-16 19:08:52.956000+08:00,2022-09-16 19:10:33.307000+08:00,2022-09-16 19:11:26.837000+08:00,2022-09-16 19:12:14.684000+08:00,2022-09-16 19:12:39.973000+08:00,7.283996132995293,2.8661857442755676,3.5443155936360276,18.74471082832447,6.730787029955828
2003472,1,2022-09-16,121,,2022-09-16 19:12:50.324000+08:00,2022-09-16 19:15:04.557000+08:00,2022-09-16 19:15:52.262000+08:00,2022-09-16 19:16:58.921000+08:00,2022-09-16 19:18:42.981000+08:00,5.445429186133147,3.2161602115306813,2.5440655906734726,4.555400654790482,4.332830708534021
2003472,1,2022-09-16,122,,2022-09-16 19:16:45.375000+08:00,2022-09-16 19:18:32.116000+08:00,2022-09-16 19:19:32.376000+08:00,2022-09-16 19:20:43.344000+08:00,2022-09-16 19:21:57.510000+08:00,6.847943114100587,2.5460823579666636,2.3895962716816452,6.391540492105515,4.895327596006479
2003472,1,2022-09-16,123,,2022-09-16 19:21:33.456000+08:00,2022-09-16 19:22:42.643000+08:00,2022-09-16 19:24:00.374000+08:00,2022-09-16 19:25:20.374000+08:00,2022-09-16 19:26:48.184000+08:00,10.564936995999403,1.9738189768698609,2.1198108526087878,5.398416947244022,4.854995676201298
2003472,1,2022-09-16,124,,2022-09-16 19:23:11.201000+08:00,2022-09-16 19:24:58.636000+08:00,2022-09-16 19:25:58.084000+08:00,2022-09-16 19:26:38.694000+08:00,2022-09-16 19:28:28.591000+08:00,6.803707320167643,2.580859286957865,4.175938640943192,4.313447975263179,4.814276061563006
2003472,1,2022-09-16,125,,2022-09-16 19:26:34.830000+08:00,2022-09-16 19:29:01.574000+08:00,2022-09-16 19:30:15.708000+08:00,2022-09-16 19:31:14.981000+08:00,2022-09-16 19:32:48.838000+08:00,4.98116649363661,2.0695891613978894,2.8610812378098465,5.050608821265303,4.085482340429837
2003472,1,2022-09-16,126,,2022-09-16 19:33:20.540000+08:00,2022-09-16 19:35:04.685000+08:00,2022-09-16 19:36:04.319000+08:00,2022-09-16 19:37:06.656000+08:00,2022-09-16 19:38:46.144000+08:00,7.018640318231414,2.5728095195873353,2.7204528323259543,4.764745417914699,4.692826498382951
2003472,1,2022-09-16,127,,2022-09-16 19:37:26.529000+08:00,2022-09-16 19:39:26.779000+08:00,2022-09-16 19:40:12.744000+08:00,2022-09-16 19:40:48.061000+08:00,2022-09-16 19:42:27.205000+08:00,6.07863863569406,3.337907601241622,4.801791437797747,4.781277658128555,5.08189239972423
2003472,1,2022-09-16,128,,2022-09-16 19:43:18.879000+08:00,2022-09-16 19:45:03.754000+08:00,2022-09-16 19:46:14.304000+08:00,2022-09-16 19:47:06.419000+08:00,2022-09-16 19:48:52.420000+08:00,6.969785896945989,2.1747260509010795,3.2540510065950885,4.471986039164702,4.581155177862638
2003472,1,2022-09-16,129,,2022-09-16 19:51:30.501000+08:00,2022-09-16 19:52:51.796000+08:00,2022-09-16 19:54:12.560000+08:00,2022-09-16 19:55:31.103000+08:00,2022-09-16 19:57:22.288000+08:00,8.99140532556997,1.899694454101718,2.159134082078645,4.263479715226852,4.343546177600317
2003472,1,2022-09-16,130,,2022-09-16 20:02:00.566000+08:00,2022-09-16 20:04:14.212000+08:00,2022-09-16 20:05:19.760000+08:00,2022-09-16 20:06:05.622000+08:00,2022-09-16 20:08:31.326000+08:00,5.469346601785394,2.340680461510208,3.6977207319502647,3.2534109711298083,3.9103364704152996
2003472,1,2022-09-16,131,,2022-09-16 20:09:23.249000+08:00,2022-09-16 20:11:26.029000+08:00,2022-09-16 20:12:15.705000+08:00,2022-09-16 20:13:11.105000+08:00,2022-09-16 20:14:58.434000+08:00,5.953382439666156,3.0885522765736195,3.061098704128214,4.416653394119927,4.558685738262399
2003472,1,2022-09-16,132,,2022-09-16 20:13:52.704000+08:00,2022-09-16 20:15:18.163000+08:00,2022-09-16 20:15:54.709000+08:00,2022-09-16 20:16:17.196000+08:00,2022-09-16 20:18:16.325000+08:00,8.553298025277742,4.198186474335663,7.541462543189534,3.979173770765284,5.796211527835348
2003472,1,2022-09-16,133,,2022-09-16 20:19:39.349000+08:00,2022-09-16 20:21:08.200000+08:00,2022-09-16 20:21:48.290000+08:00,2022-09-16 20:22:45.746000+08:00,2022-09-16 20:23:54.956000+08:00,8.226764987925973,3.827062182366454,2.951560641337772,6.8492268767157585,5.977939098614209
2003472,1,2022-09-16,134,,2022-09-16 20:24:20.640000+08:00,2022-09-16 20:26:09.172000+08:00,2022-09-16 20:26:45.668000+08:00,2022-09-16 20:27:20.632000+08:00,2022-09-16 20:28:39.435000+08:00,6.734938045389477,4.203938045020581,4.850270798784551,6.015443474709054,5.904299075250613
2003472,1,2022-09-16,135,,2022-09-16 20:25:44.692000+08:00,2022-09-16 20:27:27.397000+08:00,2022-09-16 20:28:14.297000+08:00,2022-09-16 20:29:05.595000+08:00,2022-09-16 20:30:34.563000+08:00,7.117046842336894,3.2713629614300888,3.305876802384167,5.3281516066169585,5.271320964082237
2003472,1,2022-09-16,136,,2022-09-16 20:44:10.950000+08:00,2022-09-16 20:48:49.868000+08:00,2022-09-16 20:49:38.617000+08:00,2022-09-16 20:50:21.453000+08:00,2022-09-16 20:52:27.604000+08:00,2.620685276469108,3.1472834907602443,3.958933331980181,3.757679226779792,3.076594730294093
2003472,1,2022-09-16,137,,2022-09-16 20:49:41.472000+08:00,2022-09-16 20:51:50.842000+08:00,2022-09-16 20:52:22.270000+08:00,2022-09-16 20:53:27.258000+08:00,2022-09-16 20:55:44.539000+08:00,5.650122098958109,4.881854489342979,2.609479722544209,3.4530269457353713,4.20859808018763
2003472,1,2022-09-16,138,,2022-09-16 21:11:53.573000+08:00,2022-09-16 21:13:50.571000+08:00,2022-09-16 21:14:19.462000+08:00,2022-09-16 21:15:13.212000+08:00,2022-09-16 21:17:49.930000+08:00,6.247596505429244,5.310543868023646,3.155067315510754,3.0247641760199695,4.287843592744024
2003472,1,2022-09-16,139,,2022-09-16 21:31:13.029000+08:00,2022-09-16 21:32:28.646000+08:00,2022-09-16 21:32:50.160000+08:00,2022-09-16 21:33:41.940000+08:00,2022-09-16 21:35:26.999000+08:00,9.666560375870645,7.131492186068194,3.2751036734009857,4.512083611470675,6.01647076103273
2003472,1,2022-09-16,140,,2022-09-16 21:36:37.134000+08:00,2022-09-16 21:38:33.657000+08:00,2022-09-16 21:39:05.587000+08:00,2022-09-16 21:39:46.821000+08:00,2022-09-16 21:41:48.706000+08:00,6.2730645103731515,4.80510250206925,4.1127435662002965,3.88919877045984,4.904173286365535
2003472,1,2022-09-16,141,,2022-09-16 21:42:36.334000+08:00,2022-09-16 21:44:15.352000+08:00,2022-09-16 21:44:49.007000+08:00,2022-09-16 21:46:00.153000+08:00,2022-09-16 21:47:55.783000+08:00,7.382054736938846,4.5588151208162575,2.383617746727898,4.099584814818797,4.783245773752562
2003472,1,2022-09-16,142,,2022-09-16 21:52:50.331000+08:00,2022-09-16 21:54:40.773000+08:00,2022-09-16 21:55:12.910000+08:00,2022-09-16 21:55:52.411000+08:00,2022-09-16 21:57:47.086000+08:00,6.6184630479546795,4.774152002087038,4.293179114673124,4.133725678112035,5.149039036172877
2003472,1,2022-09-16,143,,2022-09-16 22:01:40.765000+08:00,2022-09-16 22:02:59.193000+08:00,2022-09-16 22:03:44.235000+08:00,2022-09-16 22:04:16.207000+08:00,2022-09-16 22:06:11.653000+08:00,9.32009353728529,3.40630795459951,5.30416827876589,4.106118809984734,5.64071896569609
2003472,1,2022-09-16,144,,2022-09-16 22:07:48.071000+08:00,2022-09-16 22:10:32.998000+08:00,2022-09-16 22:11:37.153000+08:00,2022-09-16 22:11:50.911000+08:00,2022-09-16 22:13:52.987000+08:00,4.431998981017121,2.3915037470356344,12.32627331070672,3.883113733555307,4.187273452464354
2003472,1,2022-09-16,145,,2022-09-16 22:12:13.993000+08:00,2022-09-16 22:13:30.876000+08:00,2022-09-16 22:14:20.476000+08:00,2022-09-16 22:15:18.993000+08:00,2022-09-16 22:17:03.027000+08:00,9.507385194935301,3.093284735707079,2.8980444692773553,4.556539132759459,5.2865859351477065
2003472,1,2022-09-16,146,,2022-09-16 22:16:46.158000+08:00,2022-09-16 22:18:12.307000+08:00,2022-09-16 22:19:10.145000+08:00,2022-09-16 22:20:05.181000+08:00,2022-09-16 22:22:06.326000+08:00,8.484791418846541,2.6527010424127933,3.08134436021337,3.9129554842337497,4.772504057805534
2003472,1,2022-09-16,147,,2022-09-16 22:28:52.323000+08:00,2022-09-16 22:29:48.857000+08:00,2022-09-16 22:30:47.506000+08:00,2022-09-16 22:32:16.488000+08:00,2022-09-16 22:34:11.245000+08:00,12.929498990734967,2.616019418763681,1.905833406854229,4.130771910537026,4.79114980835277
2003472,1,2022-09-16,148,,2022-09-16 22:49:24.726000+08:00,2022-09-16 22:51:22.387000+08:00,2022-09-16 22:52:18.315000+08:00,2022-09-16 22:53:37.263000+08:00,2022-09-16 22:55:36.458000+08:00,6.212392347015669,2.7432935719330414,2.148057812847736,3.976970444544633,4.110496484508953
2003472,1,2022-09-16,149,,2022-09-16 23:04:17.780000+08:00,2022-09-16 23:11:16.276000+08:00,2022-09-16 23:11:32.528000+08:00,2022-09-16 23:12:04.227000+08:00,2022-09-16 23:13:31.224000+08:00,1.7466267203084633,9.440494886233765,5.349849150090003,5.448865962475689,2.760899168081111
2003472,1,2022-09-16,150,,2022-09-16 23:09:34.404000+08:00,2022-09-16 23:11:16.276000+08:00,2022-09-16 23:15:34.864000+08:00,2022-09-16 23:16:35.126000+08:00,2022-09-16 23:17:47.938000+08:00,7.175242421295456,0.5933257648888237,2.814126119423568,6.510396529933219,3.0960442019789562
2003472,1,2022-09-16,151,,2022-09-16 23:18:15.012000+08:00,2022-09-16 23:20:09.011000+08:00,2022-09-16 23:20:17.661000+08:00,2022-09-16 23:20:37.551000+08:00,2022-09-16 23:21:34.565000+08:00,6.411953578033235,17.737216519198974,8.526137164841781,8.314361247018233,7.657129079389849
2003472,1,2022-09-16,152,,2022-09-16 23:22:44.129000+08:00,2022-09-16 23:25:24.532000+08:00,2022-09-16 23:26:13.737000+08:00,2022-09-16 23:26:49.308000+08:00,2022-09-16 23:28:33.155000+08:00,4.556998908637686,3.1181165103357613,4.767503534022182,4.564744211556401,4.377906170828196
2003472,1,2022-09-16,153,,2022-09-16 23:27:08.358000+08:00,2022-09-16 23:29:09.653000+08:00,2022-09-16 23:29:37.533000+08:00,2022-09-16 23:30:03.629000+08:00,2022-09-16 23:30:50.305000+08:00,6.026268980108089,5.503117750755781,6.498500467838099,10.15586151635739,6.884540359542965
2003472,1,2022-09-16,154,,2022-09-16 23:31:23.713000+08:00,2022-09-16 23:33:16.227000+08:00,2022-09-16 23:33:48.347000+08:00,2022-09-16 23:34:28.572000+08:00,2022-09-16 23:35:36.629000+08:00,6.496580833871436,4.776678794865228,4.215907227065333,6.965264295186351,6.04154375041311
