route_id,route_seq,gen_date,shift_id,1,2,3,4,5,6,stop2_speed,stop3_speed,stop4_speed,stop5_speed,total_speed
2003472,1,2022-09-13,0,,2022-09-13 06:42:38.920000+08:00,2022-09-13 06:44:08.009000+08:00,2022-09-13 06:44:52.574000+08:00,2022-09-13 06:45:25.367000+08:00,2022-09-13 06:47:17.376000+08:00,8.204787301936385,3.442767258859445,5.171374019110878,4.232115206255726,5.487413017422797
2003472,1,2022-09-13,1,,2022-09-13 06:44:36.746000+08:00,2022-09-13 06:46:57.135000+08:00,2022-09-13 06:47:55.313000+08:00,2022-09-13 06:48:41.385000+08:00,2022-09-13 06:50:19.027000+08:00,5.206649352457889,2.6371983033289412,3.6808662139412878,4.854826735805264,4.464177325587696
2003472,1,2022-09-13,2,,2022-09-13 06:50:04.164000+08:00,2022-09-13 06:51:06.007000+08:00,2022-09-13 06:51:52.864000+08:00,2022-09-13 06:52:17.693000+08:00,2022-09-13 06:54:14.384000+08:00,11.819547821777899,3.2743650445199473,6.830112699210722,4.062309793707292,6.106638474860052
2003472,1,2022-09-13,3,,2022-09-13 07:03:07.275000+08:00,2022-09-13 07:04:42.393000+08:00,2022-09-13 07:05:33.310000+08:00,2022-09-13 07:05:59.336000+08:00,2022-09-13 07:07:43.177000+08:00,7.684731553882659,3.013274994423692,6.515978952151811,4.565007965423075,5.5382095061996015
2003472,1,2022-09-13,4,,2022-09-13 07:07:33.255000+08:00,2022-09-13 07:09:10.070000+08:00,2022-09-13 07:09:33.333000+08:00,2022-09-13 07:10:04.652000+08:00,2022-09-13 07:11:36.835000+08:00,7.550031461469923,6.5953197305193285,5.414759992614804,5.142325506194174,6.273105670332057
2003472,1,2022-09-13,5,,2022-09-13 07:10:48.544000+08:00,2022-09-13 07:11:44.851000+08:00,2022-09-13 07:12:15.151000+08:00,2022-09-13 07:12:42.972000+08:00,2022-09-13 07:14:19.810000+08:00,12.98162388232743,5.063594814886836,6.0955705477410245,4.8951340603636755,7.232602875898073
2003472,1,2022-09-13,6,,2022-09-13 07:22:15.395000+08:00,2022-09-13 07:23:26.037000+08:00,2022-09-13 07:24:03.866000+08:00,2022-09-13 07:24:36.626000+08:00,2022-09-13 07:26:20.916000+08:00,10.347332973899531,4.055801710092023,5.176583278653939,4.545354225117437,6.22351277153271
2003472,1,2022-09-13,7,,2022-09-13 07:24:13.006000+08:00,2022-09-13 07:26:13.010000+08:00,2022-09-13 07:27:13.637000+08:00,2022-09-13 07:27:37.376000+08:00,2022-09-13 07:29:16.380000+08:00,6.091099429537437,2.530669881258699,7.14372417577417,4.788038787700472,5.036697538943621
2003472,1,2022-09-13,8,,2022-09-13 07:27:25.014000+08:00,2022-09-13 07:28:02.971000+08:00,2022-09-13 07:28:59.501000+08:00,2022-09-13 07:29:14.217000+08:00,2022-09-13 07:30:48.506000+08:00,19.257483361230094,2.714079654892467,11.523842634459298,5.027468656338465,7.508909830261055
2003472,1,2022-09-13,9,,2022-09-13 07:31:51.357000+08:00,2022-09-13 07:33:36.179000+08:00,2022-09-13 07:34:38.554000+08:00,2022-09-13 07:34:53.138000+08:00,2022-09-13 07:36:18.655000+08:00,6.973309953465978,2.45975026679072,11.62814510482056,5.543166763772087,5.716477785765259
2003472,1,2022-09-13,10,,2022-09-13 07:36:31.768000+08:00,2022-09-13 07:37:57.509000+08:00,2022-09-13 07:38:39.103000+08:00,2022-09-13 07:39:15.103000+08:00,2022-09-13 07:40:58.668000+08:00,8.525166442451226,3.6886792059208333,4.7106907835750835,4.577173679693889,5.725002170024287
2003472,1,2022-09-13,11,,2022-09-13 07:38:41.790000+08:00,2022-09-13 07:39:56.817000+08:00,2022-09-13 07:40:21.033000+08:00,2022-09-13 07:41:04.029000+08:00,2022-09-13 07:42:22.935000+08:00,9.74257661831355,6.335766554801419,3.9442010468114015,6.0075912115364805,6.909507694858497
2003472,1,2022-09-13,12,,2022-09-13 07:45:03.033000+08:00,2022-09-13 07:48:25.631000+08:00,2022-09-13 07:49:37.773000+08:00,2022-09-13 07:50:01.304000+08:00,2022-09-13 07:51:53.854000+08:00,3.607914668171505,2.126735090392159,7.206870435115509,4.2117724756774555,3.7193889289483306
2003472,1,2022-09-13,13,,2022-09-13 07:57:34.320000+08:00,2022-09-13 07:59:03.014000+08:00,2022-09-13 07:59:46.910000+08:00,2022-09-13 08:00:19.422000+08:00,2022-09-13 08:01:46.943000+08:00,8.241327439761546,3.4952369894995248,5.216070011340521,5.416242868997127,6.048550920460459
2003472,1,2022-09-13,14,,2022-09-13 08:04:00.299000+08:00,2022-09-13 08:04:49.332000+08:00,2022-09-13 08:05:28.675000+08:00,2022-09-13 08:06:11.930000+08:00,2022-09-13 08:07:06.397000+08:00,14.907435725780813,3.899726073026234,3.9205841685054454,8.703159567031369,8.21074422712486
2003472,1,2022-09-13,15,,2022-09-13 08:05:51.530000+08:00,2022-09-13 08:06:32.075000+08:00,2022-09-13 08:07:34.134000+08:00,2022-09-13 08:08:09.520000+08:00,2022-09-13 08:09:36.753000+08:00,18.028272189966966,2.4722751396424556,4.792428310877268,5.4341246103825105,6.78440070143583
2003472,1,2022-09-13,16,,2022-09-13 08:10:06.486000+08:00,2022-09-13 08:12:31.840000+08:00,2022-09-13 08:13:16.904000+08:00,2022-09-13 08:14:08.584000+08:00,2022-09-13 08:15:36.566000+08:00,5.028800693081791,3.4046450135600734,3.2814409483108173,5.387863337245091,4.6291901332388585
2003472,1,2022-09-13,17,,2022-09-13 08:19:48.331000+08:00,2022-09-13 08:21:16.725000+08:00,2022-09-13 08:21:56.216000+08:00,2022-09-13 08:23:08.048000+08:00,2022-09-13 08:24:48.756000+08:00,8.269297643982743,3.8851111111663705,2.3608540512404366,4.707024190109004,5.08613823476569
2003472,1,2022-09-13,18,,2022-09-13 08:25:55.220000+08:00,2022-09-13 08:27:46.125000+08:00,2022-09-13 08:28:29.357000+08:00,2022-09-13 08:29:11.683000+08:00,2022-09-13 08:30:03.894000+08:00,6.590832658060598,3.548920311136916,4.0066358316094846,9.079216872641734,6.144603292581782
2003472,1,2022-09-13,19,,2022-09-13 08:29:58.346000+08:00,2022-09-13 08:31:54.944000+08:00,2022-09-13 08:32:34.402000+08:00,2022-09-13 08:33:03.038000+08:00,2022-09-13 08:34:32.208000+08:00,6.269029451124467,3.888360355088224,5.922086471878162,5.316081553633482,5.579463668488078
2003472,1,2022-09-13,20,,2022-09-13 08:33:51.334000+08:00,2022-09-13 08:35:00.383000+08:00,2022-09-13 08:35:40.843000+08:00,2022-09-13 08:36:27.851000+08:00,2022-09-13 08:38:02.361000+08:00,10.586051875366921,3.7920643324535623,3.6075746300353777,5.0157125398105755,6.0870068924039336
2003472,1,2022-09-13,21,,2022-09-13 08:37:29.159000+08:00,2022-09-13 08:39:41.007000+08:00,2022-09-13 08:40:16.593000+08:00,2022-09-13 08:41:08.806000+08:00,2022-09-13 08:42:37.858000+08:00,5.543931617788746,4.31144053535298,3.2479433897439915,5.3231257258399305,4.949815448639232
2003472,1,2022-09-13,22,,2022-09-13 08:41:44.909000+08:00,2022-09-13 08:43:02.713000+08:00,2022-09-13 08:44:51.295000+08:00,2022-09-13 08:45:33.466000+08:00,2022-09-13 08:46:40.947000+08:00,9.39484211534382,1.4130051287604866,4.021362268115602,7.02471795227542,5.161509938519657
2003472,1,2022-09-13,23,,2022-09-13 08:46:09.567000+08:00,2022-09-13 08:48:57.948000+08:00,2022-09-13 08:49:37.947000+08:00,2022-09-13 08:50:24.678000+08:00,2022-09-13 08:56:47.900000+08:00,4.341085371521791,3.8357689665009413,3.6289586828594085,1.2369722827434166,2.393739755236659
2003472,1,2022-09-13,24,,2022-09-13 08:53:27.966000+08:00,2022-09-13 08:55:17.381000+08:00,2022-09-13 08:56:22.993000+08:00,2022-09-13 08:57:02.167000+08:00,2022-09-13 08:59:00.807000+08:00,6.680585805805516,2.3383972884696576,4.329015883205775,3.995574782008577,4.590789834123448
2003472,1,2022-09-13,25,,2022-09-13 08:55:33.596000+08:00,2022-09-13 08:57:48.788000+08:00,2022-09-13 08:58:31.037000+08:00,2022-09-13 08:59:09.249000+08:00,2022-09-13 09:01:29.857000+08:00,5.406801407939898,3.6314924114433746,4.438000319499189,3.3713230551426485,4.2889990180779884
2003472,1,2022-09-13,26,,2022-09-13 08:58:19.318000+08:00,2022-09-13 09:00:22.515000+08:00,2022-09-13 09:01:10.933000+08:00,2022-09-13 09:01:59.288000+08:00,2022-09-13 09:03:58.645000+08:00,5.9332312957475475,3.1687992666171905,3.507080306249675,3.9715726110533742,4.50304007396842
2003472,1,2022-09-13,27,,2022-09-13 09:06:30.793000+08:00,2022-09-13 09:08:02.996000+08:00,2022-09-13 09:09:09.945000+08:00,2022-09-13 09:09:57.698000+08:00,2022-09-13 09:11:27.744000+08:00,7.927684521568828,2.2916985002176458,3.551292446730112,5.264364792855846,5.145640456437197
2003472,1,2022-09-13,28,,2022-09-13 09:12:12.690000+08:00,2022-09-13 09:13:52.347000+08:00,2022-09-13 09:15:08.737000+08:00,2022-09-13 09:16:03.885000+08:00,2022-09-13 09:17:51.982000+08:00,7.334721052632636,2.008468685574959,3.075086462042196,4.3852742642025,4.503504589496606
2003472,1,2022-09-13,29,,2022-09-13 09:15:38.930000+08:00,2022-09-13 09:18:31.615000+08:00,2022-09-13 09:19:12.985000+08:00,2022-09-13 09:19:55.302000+08:00,2022-09-13 09:21:28.784000+08:00,4.232888183352408,3.708651749844601,4.00748796485344,5.070869174145799,4.367544973558919
2003472,1,2022-09-13,30,,2022-09-13 09:19:06.460000+08:00,2022-09-13 09:22:02.951000+08:00,2022-09-13 09:22:44.065000+08:00,2022-09-13 09:23:21.445000+08:00,2022-09-13 09:25:28.458000+08:00,4.141606631172188,3.731744001825927,4.536780850955137,3.732176959346662,4.0000290032395
2003472,1,2022-09-13,31,,2022-09-13 09:30:58.702000+08:00,2022-09-13 09:31:50.929000+08:00,2022-09-13 09:32:42.918000+08:00,2022-09-13 09:33:21.011000+08:00,2022-09-13 09:35:21.586000+08:00,13.995754991521832,2.951142027949589,4.451864337508282,3.9314533869997725,5.812461310614119
2003472,1,2022-09-13,32,,2022-09-13 09:33:36.741000+08:00,2022-09-13 09:35:08.023000+08:00,2022-09-13 09:36:13.799000+08:00,2022-09-13 09:37:18.737000+08:00,2022-09-13 09:39:30.610000+08:00,8.007671785699378,2.332566937653113,2.6114889311143403,3.5946326551871692,4.3179907795808115
2003472,1,2022-09-13,33,,2022-09-13 09:41:28.673000+08:00,2022-09-13 09:44:31.398000+08:00,2022-09-13 09:45:44.333000+08:00,2022-09-13 09:46:21.592000+08:00,2022-09-13 09:48:31.175000+08:00,4.000308091077907,2.103611748695018,4.551514216932903,3.658157259343414,3.616558215533849
2003472,1,2022-09-13,34,,2022-09-13 09:45:24.159000+08:00,2022-09-13 09:47:59.794000+08:00,2022-09-13 09:48:44.725000+08:00,2022-09-13 09:49:13.906000+08:00,2022-09-13 09:51:12.278000+08:00,4.696606135780581,3.4147230840860687,5.811482410085433,4.004620958820477,4.389312502849549
2003472,1,2022-09-13,35,,2022-09-13 09:53:07.184000+08:00,2022-09-13 09:54:29.575000+08:00,2022-09-13 09:55:11.451000+08:00,2022-09-13 09:56:14.226000+08:00,2022-09-13 09:57:12.936000+08:00,8.871797841295901,3.663839022138484,2.701471417103991,8.074178029935233,6.217662843759083
2003472,1,2022-09-13,36,,2022-09-13 09:56:43.752000+08:00,2022-09-13 09:58:21.093000+08:00,2022-09-13 09:59:03.132000+08:00,2022-09-13 10:00:07.853000+08:00,2022-09-13 10:01:42.380000+08:00,7.509233477591258,3.6496330286417646,2.620244869651319,5.014810500042291,5.116744173953823
2003472,1,2022-09-13,37,,2022-09-13 10:01:24.796000+08:00,2022-09-13 10:03:18.441000+08:00,2022-09-13 10:04:10.236000+08:00,2022-09-13 10:05:13.781000+08:00,2022-09-13 10:07:19.246000+08:00,6.431926577871535,2.9621956345413873,2.6687366151342045,3.7782249403219827,4.310912905006298
2003472,1,2022-09-13,38,,2022-09-13 10:14:11.871000+08:00,2022-09-13 10:16:38.953000+08:00,2022-09-13 10:17:51.788000+08:00,2022-09-13 10:19:18.647000+08:00,2022-09-13 10:21:36.757000+08:00,4.969719584600499,2.1064999367209607,1.9524156185162511,3.4323002833791723,3.434594658360753
2003472,1,2022-09-13,39,,2022-09-13 10:20:53.335000+08:00,2022-09-13 10:21:52.901000+08:00,2022-09-13 10:23:38.162000+08:00,2022-09-13 10:24:12.133000+08:00,2022-09-13 10:28:45.186000+08:00,12.271367826313847,1.4575856479709595,4.992048164867183,1.7360548762969006,3.238316924578908
2003472,1,2022-09-13,40,,2022-09-13 10:24:01.862000+08:00,2022-09-13 10:26:29.675000+08:00,2022-09-13 10:27:37.082000+08:00,2022-09-13 10:29:44.539000+08:00,2022-09-13 10:31:32.217000+08:00,4.945142145428418,2.2761274480554117,1.330526124172882,4.402338380518747,3.3928857882769865
2003472,1,2022-09-13,41,,2022-09-13 10:30:25.225000+08:00,2022-09-13 10:32:03.450000+08:00,2022-09-13 10:33:39.312000+08:00,2022-09-13 10:34:31.632000+08:00,2022-09-13 10:36:54.609000+08:00,7.441652287525687,1.6004978290779575,3.2413009978727643,3.315463271277881,3.9241547654230327
2003472,1,2022-09-13,42,,2022-09-13 10:39:52.272000+08:00,2022-09-13 10:41:58.835000+08:00,2022-09-13 10:42:49.388000+08:00,2022-09-13 10:44:16.225000+08:00,2022-09-13 10:46:25.464000+08:00,5.7754343365929275,3.0349716711386296,1.9529102595518388,3.6678943054147553,3.886149970445691
2003472,1,2022-09-13,43,,2022-09-13 10:49:06.219000+08:00,2022-09-13 10:50:35.611000+08:00,2022-09-13 10:51:36.797000+08:00,2022-09-13 10:52:47.734000+08:00,2022-09-13 10:54:50.675000+08:00,8.176976641558648,2.5075494866647783,2.39064054313973,3.8557925520168013,4.435989151530187
2003472,1,2022-09-13,44,,2022-09-13 10:54:32.497000+08:00,2022-09-13 10:56:50.299000+08:00,2022-09-13 10:58:17.526000+08:00,2022-09-13 10:59:17.416000+08:00,2022-09-13 11:00:53.853000+08:00,5.30439540748473,1.75893843524449,2.8316057473485228,4.9154887868504575,4.006762917535013
2003472,1,2022-09-13,45,,2022-09-13 11:00:26.110000+08:00,2022-09-13 11:02:32.608000+08:00,2022-09-13 11:03:39.575000+08:00,2022-09-13 11:04:18.850000+08:00,2022-09-13 11:05:57.941000+08:00,5.778401997993728,2.291082516628655,4.317883340769014,4.783834981355498,4.604762903946534
2003472,1,2022-09-13,46,,2022-09-13 11:06:36.939000+08:00,2022-09-13 11:08:13.442000+08:00,2022-09-13 11:09:16.206000+08:00,2022-09-13 11:11:11.838000+08:00,2022-09-13 11:13:15.127000+08:00,7.574441167033259,2.444505176392058,1.4665911530433013,3.8449090522065847,3.8373910795390174
2003472,1,2022-09-13,47,,2022-09-13 11:14:46.097000+08:00,2022-09-13 11:16:39.575000+08:00,2022-09-13 11:19:03.275000+08:00,2022-09-13 11:20:21.948000+08:00,2022-09-13 11:22:16.303000+08:00,6.441392128361539,1.0676890945794792,2.1555663087552657,4.145293097262888,3.3940086964178224
2003472,1,2022-09-13,48,,2022-09-13 11:19:30.242000+08:00,2022-09-13 11:21:33.483000+08:00,2022-09-13 11:23:21.635000+08:00,2022-09-13 11:24:13.198000+08:00,2022-09-13 11:26:09.986000+08:00,5.931112989526299,1.418623075773644,3.2888867639334993,4.058935782250725,3.8224540685525787
2003472,1,2022-09-13,49,,2022-09-13 11:33:25.422000+08:00,2022-09-13 11:35:28.024000+08:00,2022-09-13 11:36:21.124000+08:00,2022-09-13 11:37:16.617000+08:00,2022-09-13 11:40:33.192000+08:00,5.962025871863514,2.889395911319607,3.0559686484548143,2.411471408559062,3.5720201958517013
2003472,1,2022-09-13,50,,2022-09-13 11:39:12.626000+08:00,2022-09-13 11:40:22.117000+08:00,2022-09-13 11:41:55.109000+08:00,2022-09-13 11:43:05.591000+08:00,2022-09-13 11:44:57.122000+08:00,10.518718912408954,1.649893785390906,2.4060734401507196,4.250253222310367,4.435474081497267
2003472,1,2022-09-13,51,,2022-09-13 11:43:01.696000+08:00,2022-09-13 11:44:27.885000+08:00,2022-09-13 11:46:48.423000+08:00,2022-09-13 11:48:07.685000+08:00,2022-09-13 11:50:37.021000+08:00,8.480853658149076,1.0917113015061488,2.139548184611832,3.174284781549643,3.3558514888914126
2003472,1,2022-09-13,52,,2022-09-13 11:49:38.805000+08:00,2022-09-13 11:51:22.543000+08:00,2022-09-13 11:52:23.404000+08:00,2022-09-13 11:53:20.309000+08:00,2022-09-13 11:54:57.235000+08:00,7.0461768680927985,2.5209398940384014,2.980140026512662,4.890689723474584,4.798552520740766
2003472,1,2022-09-13,53,,2022-09-13 11:54:59.274000+08:00,2022-09-13 11:57:32.343000+08:00,2022-09-13 11:58:31.477000+08:00,2022-09-13 11:59:25.813000+08:00,2022-09-13 12:01:31.413000+08:00,4.775338546290958,2.5945635825594606,3.1210407134993936,3.774163950139312,3.896585341369979
2003472,1,2022-09-13,54,,2022-09-13 12:05:09.362000+08:00,2022-09-13 12:06:42.952000+08:00,2022-09-13 12:07:26.673000+08:00,2022-09-13 12:08:11.740000+08:00,2022-09-13 12:11:27.887000+08:00,7.810196558844008,3.509227210975759,3.7629500123971646,2.4167333282563463,4.03672961938969
2003472,1,2022-09-13,55,,2022-09-13 12:11:07.498000+08:00,2022-09-13 12:12:03.217000+08:00,2022-09-13 12:13:09.845000+08:00,2022-09-13 12:14:07.219000+08:00,2022-09-13 12:15:50.182000+08:00,13.118618351768887,2.3027394322367645,2.9557790673249733,4.603935317905438,5.405339811165407
2003472,1,2022-09-13,56,,2022-09-13 12:22:33.705000+08:00,2022-09-13 12:24:03.271000+08:00,2022-09-13 12:26:01.334000+08:00,2022-09-13 12:27:29.939000+08:00,2022-09-13 12:30:32.414000+08:00,8.161091217004339,1.299534340911811,1.9139424209548335,2.5978078758048917,3.1919246957535417
2003472,1,2022-09-13,57,,2022-09-13 14:20:56.809000+08:00,2022-09-13 14:22:58.261000+08:00,2022-09-13 14:23:37.658000+08:00,2022-09-13 14:24:30.964000+08:00,2022-09-13 14:27:40.709000+08:00,6.0184788718358755,3.8943808637985415,3.1813467191067244,2.498273957877665,3.7831222559531623
2003472,1,2022-09-13,58,,2022-09-13 14:24:07.852000+08:00,2022-09-13 14:26:44.192000+08:00,2022-09-13 14:28:06.872000+08:00,2022-09-13 14:29:44.198000+08:00,2022-09-13 14:31:58.620000+08:00,4.675427247935337,1.8556715395630277,1.7424415696597317,3.5264688230906964,3.2457666603921305
2003472,1,2022-09-13,59,,2022-09-13 14:31:20.719000+08:00,2022-09-13 14:32:58.150000+08:00,2022-09-13 14:33:37.574000+08:00,2022-09-13 14:35:22.290000+08:00,2022-09-13 14:36:26.764000+08:00,7.502296968544002,3.891713750280822,1.6194742752655091,7.352343458409554,4.992739888511435
2003472,1,2022-09-13,60,,2022-09-13 14:35:54.380000+08:00,2022-09-13 14:38:34.136000+08:00,2022-09-13 14:39:50.394000+08:00,2022-09-13 14:41:23.398000+08:00,2022-09-13 14:43:24.562000+08:00,4.5754544176256955,2.0119452764440604,1.823414780103039,3.9123418848626454,3.394189637034538
2003472,1,2022-09-13,61,,2022-09-13 14:37:51.722000+08:00,2022-09-13 14:38:34.136000+08:00,2022-09-13 14:42:32.930000+08:00,2022-09-13 14:43:28.400000+08:00,2022-09-13 14:45:42.453000+08:00,17.233844861182877,0.6425074452920556,3.057235770843754,3.536175931441278,3.246021781398468
2003472,1,2022-09-13,62,,2022-09-13 14:52:54.923000+08:00,2022-09-13 14:55:19.071000+08:00,2022-09-13 14:57:16.376000+08:00,2022-09-13 14:58:48.547000+08:00,2022-09-13 15:01:50.119000+08:00,5.070873657228756,1.3079316558635279,1.839893981932528,2.610727381630965,2.85503456524242
2003472,1,2022-09-13,63,,2022-09-13 15:05:20.411000+08:00,2022-09-13 15:07:23.382000+08:00,2022-09-13 15:09:15.180000+08:00,2022-09-13 15:11:08.030000+08:00,2022-09-13 15:13:28.456000+08:00,5.944135576210738,1.372358386474455,1.5027458414594865,3.375692479579975,3.1308651439508286
2003472,1,2022-09-13,64,,2022-09-13 15:19:37.387000+08:00,2022-09-13 15:21:10.646000+08:00,2022-09-13 15:22:54.294000+08:00,2022-09-13 15:24:21.241000+08:00,2022-09-13 15:26:30.276000+08:00,7.837916940372625,1.480269015234941,1.9504395575316347,3.673693123086741,3.7007599601333094
2003472,1,2022-09-13,65,,2022-09-13 15:37:16.496000+08:00,2022-09-13 15:39:12.848000+08:00,2022-09-13 15:40:33.101000+08:00,2022-09-13 15:41:42.838000+08:00,2022-09-13 15:44:09.697000+08:00,6.282283896643037,1.9117904986862941,2.4317775099115684,3.227823913668877,3.6979655886105847
2003472,1,2022-09-13,66,,2022-09-13 15:54:25.667000+08:00,2022-09-13 15:56:42.509000+08:00,2022-09-13 15:57:45.167000+08:00,2022-09-13 15:58:14.037000+08:00,2022-09-13 16:01:29.236000+08:00,5.3416078100452395,2.4486406028132266,5.874086186654071,2.4284703924584528,3.6074478518953987
2003472,1,2022-09-13,67,,2022-09-13 16:27:57.911000+08:00,2022-09-13 16:30:44.060000+08:00,2022-09-13 16:31:51.328000+08:00,2022-09-13 16:33:37.086000+08:00,2022-09-13 16:35:36.105000+08:00,4.399402319256875,2.2808307500010576,1.6035181093506217,3.982851411434288,3.334838690990022
2003472,1,2022-09-13,68,,2022-09-13 16:34:20.205000+08:00,2022-09-13 16:37:06.060000+08:00,2022-09-13 16:37:47.406000+08:00,2022-09-13 16:38:25.596000+08:00,2022-09-13 16:40:08.052000+08:00,4.407200843762387,3.7108045008240493,4.440556905176828,4.62671773383206,4.392744738863588
2003472,1,2022-09-13,69,,2022-09-13 16:39:46.878000+08:00,2022-09-13 16:41:44.228000+08:00,2022-09-13 16:42:47.439000+08:00,2022-09-13 16:43:36.706000+08:00,2022-09-13 16:45:29.080000+08:00,6.228856377862894,2.4272187260298232,3.442159421290174,4.218368947777044,4.465207915732469
2003472,1,2022-09-13,70,,2022-09-13 16:45:31.072000+08:00,2022-09-13 16:48:03.821000+08:00,2022-09-13 16:48:50.543000+08:00,2022-09-13 16:49:39.562000+08:00,2022-09-13 16:51:36.639000+08:00,4.785342594335876,3.283826096722554,3.459574210177748,4.048916457865316,4.179816775528104
2003472,1,2022-09-13,71,,2022-09-13 17:01:42.159000+08:00,2022-09-13 17:03:50.759000+08:00,2022-09-13 17:04:39.080000+08:00,2022-09-13 17:05:47.527000+08:00,2022-09-13 17:08:25.492000+08:00,5.683952534542851,3.1751603421094585,2.4776084884465797,3.0008862225018045,3.7884405173379867
2003472,1,2022-09-13,72,,2022-09-13 17:07:17.075000+08:00,2022-09-13 17:09:41.449000+08:00,2022-09-13 17:10:41.903000+08:00,2022-09-13 17:11:34.590000+08:00,2022-09-13 17:13:33.289000+08:00,5.0629358190686045,2.5379118485306376,3.218723180456337,3.9935887592776482,4.061526363132372
2003472,1,2022-09-13,73,,2022-09-13 17:11:30.668000+08:00,2022-09-13 17:14:05.768000+08:00,2022-09-13 17:14:58.677000+08:00,2022-09-13 17:15:20.159000+08:00,2022-09-13 17:16:39.084000+08:00,4.712806550239915,2.8998265491895734,7.894277451294248,6.006144974817834,4.9543573588253595
2003472,1,2022-09-13,74,,2022-09-13 17:17:08.054000+08:00,2022-09-13 17:18:31.360000+08:00,2022-09-13 17:19:18.337000+08:00,2022-09-13 17:20:26.157000+08:00,2022-09-13 17:21:57.302000+08:00,8.774353539267409,3.266000870448755,2.5005141287039674,5.2008886075758145,5.282674656970773
2003472,1,2022-09-13,75,,2022-09-13 17:21:03.289000+08:00,2022-09-13 17:23:25.201000+08:00,2022-09-13 17:24:41.166000+08:00,2022-09-13 17:24:56.147000+08:00,2022-09-13 17:26:24.036000+08:00,5.15077157634457,2.0197054286983627,11.319996542867834,5.393564520446217,4.763888919240031
2003472,1,2022-09-13,76,,2022-09-13 17:29:06.430000+08:00,2022-09-13 17:30:56.031000+08:00,2022-09-13 17:31:48.284000+08:00,2022-09-13 17:32:10.064000+08:00,2022-09-13 17:34:05.097000+08:00,6.669248418738977,2.9362318506319474,7.786265757975345,4.12086090198028,5.116076028417878
2003472,1,2022-09-13,77,,2022-09-13 17:34:13.562000+08:00,2022-09-13 17:36:30.175000+08:00,2022-09-13 17:37:53.479000+08:00,2022-09-13 17:38:53.853000+08:00,2022-09-13 17:40:14.691000+08:00,5.350561776274664,1.8417713782179863,2.808905625082039,5.864011877303962,4.23118353602032
2003472,1,2022-09-13,78,,2022-09-13 17:38:51.095000+08:00,2022-09-13 17:41:13.248000+08:00,2022-09-13 17:42:06.467000+08:00,2022-09-13 17:43:08.184000+08:00,2022-09-13 17:44:34.813000+08:00,5.142039182727137,2.8829350963203204,2.747782105557675,5.4720127455874765,4.445513703615994
2003472,1,2022-09-13,79,,2022-09-13 17:42:26.354000+08:00,2022-09-13 17:43:44.253000+08:00,2022-09-13 17:44:36.160000+08:00,2022-09-13 17:45:30.313000+08:00,2022-09-13 17:47:18.559000+08:00,9.383384843736257,2.955804089835112,3.131587690593375,4.379237959254823,5.229216061256591
2003472,1,2022-09-13,80,,2022-09-13 17:52:15.257000+08:00,2022-09-13 17:54:56.781000+08:00,2022-09-13 17:56:05.670000+08:00,2022-09-13 17:57:33.712000+08:00,2022-09-13 17:59:44.695000+08:00,4.525372674910296,2.2271614175132624,1.9261814612196795,3.619057374907412,3.39980838108812
2003472,1,2022-09-13,81,,2022-09-13 17:59:54.235000+08:00,2022-09-13 18:02:09.059000+08:00,2022-09-13 18:02:56.571000+08:00,2022-09-13 18:03:41.671000+08:00,2022-09-13 18:05:16.484000+08:00,5.421559187846456,3.2292246777881615,3.7601966343393136,4.999683504767253,4.741684471261299
2003472,1,2022-09-13,82,,2022-09-13 18:04:45.185000+08:00,2022-09-13 18:07:01.156000+08:00,2022-09-13 18:08:06.472000+08:00,2022-09-13 18:08:19.215000+08:00,2022-09-13 18:09:31.445000+08:00,5.375824962250853,2.3489944713557342,13.308080374221378,6.5628546606326665,5.33781554942878
2003472,1,2022-09-13,83,,2022-09-13 18:09:22.471000+08:00,2022-09-13 18:11:16.346000+08:00,2022-09-13 18:12:21.849000+08:00,2022-09-13 18:12:58.602000+08:00,2022-09-13 18:14:19.321000+08:00,6.418935639448612,2.342288488940524,4.614177569414824,5.872656897849299,5.147391204916564
2003472,1,2022-09-13,84,,2022-09-13 18:12:57.381000+08:00,2022-09-13 18:14:18.655000+08:00,2022-09-13 18:15:30.970000+08:00,2022-09-13 18:16:11.416000+08:00,2022-09-13 18:17:41.337000+08:00,8.993728571772161,2.121647277758019,4.192871191433097,5.2716828342378035,5.3811262279348995
2003472,1,2022-09-13,85,,2022-09-13 18:17:09.065000+08:00,2022-09-13 18:18:38.815000+08:00,2022-09-13 18:19:16.591000+08:00,2022-09-13 18:20:10.253000+08:00,2022-09-13 18:21:18.820000+08:00,8.14435984336725,4.0614920290944285,3.16024129195153,6.913456796089921,6.118007964523162
2003472,1,2022-09-13,86,,2022-09-13 18:27:33.064000+08:00,2022-09-13 18:30:35.470000+08:00,2022-09-13 18:34:17.677000+08:00,2022-09-13 18:34:57.937000+08:00,2022-09-13 18:36:43.470000+08:00,4.007304013805525,0.690468450098652,4.212242131363712,4.491817650758508,2.7761381220035433
2003472,1,2022-09-13,87,,2022-09-13 18:33:34.017000+08:00,2022-09-13 18:35:44.568000+08:00,2022-09-13 18:37:03.317000+08:00,2022-09-13 18:38:00.652000+08:00,2022-09-13 18:39:33.521000+08:00,5.599009551380003,1.9483031262755228,2.9577896260347614,5.1043404380094275,4.250308978980713
2003472,1,2022-09-13,88,,2022-09-13 18:39:32.647000+08:00,2022-09-13 18:41:29.754000+08:00,2022-09-13 18:42:31.087000+08:00,2022-09-13 18:43:05.961000+08:00,2022-09-13 18:44:34.765000+08:00,6.24178141308556,2.501539512025682,4.862787985568131,5.33799144337527,5.0576366822879875
2003472,1,2022-09-13,89,,2022-09-13 18:41:17.712000+08:00,2022-09-13 18:42:35.841000+08:00,2022-09-13 18:43:34.556000+08:00,2022-09-13 18:44:17.661000+08:00,2022-09-13 18:47:23.524000+08:00,9.355761573067754,2.6130788195703167,3.9342273102587413,2.5504537865928,4.1770173728021005
2003472,1,2022-09-13,90,,2022-09-13 18:48:07.746000+08:00,2022-09-13 18:50:07.522000+08:00,2022-09-13 18:51:12.395000+08:00,2022-09-13 18:52:13.575000+08:00,2022-09-13 18:53:48.926000+08:00,6.10269416195407,2.365035113083581,2.771900428386777,4.97147373533049,4.478583384663469
2003472,1,2022-09-13,91,,2022-09-13 18:57:26.474000+08:00,2022-09-13 19:00:02.800000+08:00,2022-09-13 19:01:07.296000+08:00,2022-09-13 19:01:57.703000+08:00,2022-09-13 19:04:14.196000+08:00,4.675845962553963,2.378859508978404,3.364311865588173,3.4729619257947113,3.747659138284131
2003472,1,2022-09-13,92,,2022-09-13 18:59:47.201000+08:00,2022-09-13 19:02:29.260000+08:00,2022-09-13 19:03:30.411000+08:00,2022-09-13 19:04:05.557000+08:00,2022-09-13 19:05:25.734000+08:00,4.510433212238818,2.508984691845941,4.825154162883487,5.912356313375376,4.513601566699501
2003472,1,2022-09-13,93,,2022-09-13 19:12:36.506000+08:00,2022-09-13 19:14:13.047000+08:00,2022-09-13 19:15:13.383000+08:00,2022-09-13 19:15:50.180000+08:00,2022-09-13 19:23:23.798000+08:00,7.5714597522525215,2.5428752799501315,4.608660168184989,1.045009219513991,2.3606086266777315
2003472,1,2022-09-13,94,,2022-09-13 19:18:46.580000+08:00,2022-09-13 19:20:10.009000+08:00,2022-09-13 19:20:48.651000+08:00,2022-09-13 19:21:33.850000+08:00,2022-09-13 19:23:49.549000+08:00,8.761417444080722,3.970470547359638,3.7519606232151825,3.4932828697153075,5.043430447271775
2003472,1,2022-09-13,95,,2022-09-13 19:27:42.467000+08:00,2022-09-13 19:29:03.350000+08:00,2022-09-13 19:29:24.756000+08:00,2022-09-13 19:30:34.617000+08:00,2022-09-13 19:32:44.521000+08:00,9.037205543095714,7.1674728062725945,2.4274612188302918,3.6491177495496485,5.058708307718098
2003472,1,2022-09-13,96,,2022-09-13 19:30:39.132000+08:00,2022-09-13 19:32:36.771000+08:00,2022-09-13 19:33:32.243000+08:00,2022-09-13 19:34:21.809000+08:00,2022-09-13 19:36:37.243000+08:00,6.213554143967652,2.7658444420801693,3.4213950734112704,3.500118080670272,4.266842066229415
2003472,1,2022-09-13,97,,2022-09-13 19:32:14.134000+08:00,2022-09-13 19:34:57.257000+08:00,2022-09-13 19:35:53.277000+08:00,2022-09-13 19:37:16.955000+08:00,2022-09-13 19:38:58.942000+08:00,4.48101307566812,2.738788341504305,2.026636250970423,4.647994275128179,3.7746365664203334
2003472,1,2022-09-13,98,,2022-09-13 19:36:56.219000+08:00,2022-09-13 19:38:46.662000+08:00,2022-09-13 19:39:54.518000+08:00,2022-09-13 19:40:32.613000+08:00,2022-09-13 19:42:22.481000+08:00,6.6184031214491705,2.261066418460728,4.451630613169788,4.314586523259708,4.683362080718815
2003472,1,2022-09-13,99,,2022-09-13 19:43:39.013000+08:00,2022-09-13 19:45:37.544000+08:00,2022-09-13 19:46:14.955000+08:00,2022-09-13 19:47:23.318000+08:00,2022-09-13 19:49:27.754000+08:00,6.1667943064870006,4.101117930316515,2.4806528123210367,3.8094682578795327,4.381483906909375
2003472,1,2022-09-13,100,,2022-09-13 19:57:24.297000+08:00,2022-09-13 19:59:59.854000+08:00,2022-09-13 20:00:40.512000+08:00,2022-09-13 20:01:26.704000+08:00,2022-09-13 20:03:16.500000+08:00,4.6989611264180375,3.77359739512694,3.6713038666587945,4.31741586339664,4.33841585443475
2003472,1,2022-09-13,101,,2022-09-13 20:02:09.601000+08:00,2022-09-13 20:03:51.300000+08:00,2022-09-13 20:04:38.985000+08:00,2022-09-13 20:05:06.383000+08:00,2022-09-13 20:06:52.686000+08:00,7.187448214261798,3.217509130566659,6.189680568242317,4.459281413859417,5.3976829545171325
2003472,1,2022-09-13,102,,2022-09-13 20:09:34.961000+08:00,2022-09-13 20:11:02.872000+08:00,2022-09-13 20:11:24.572000+08:00,2022-09-13 20:12:21.728000+08:00,2022-09-13 20:13:53.918000+08:00,8.314730761135815,7.070365110187611,2.967052771514855,5.141935048676619,5.90060542553197
2003472,1,2022-09-13,103,,2022-09-13 20:13:14.975000+08:00,2022-09-13 20:14:40.561000+08:00,2022-09-13 20:15:25.955000+08:00,2022-09-13 20:16:08.960000+08:00,2022-09-13 20:17:49.594000+08:00,8.540605892812033,3.37989432284159,3.943375612340496,4.710485443662158,5.564083618320225
2003472,1,2022-09-13,104,,2022-09-13 20:24:11.597000+08:00,2022-09-13 20:26:10.232000+08:00,2022-09-13 20:26:44.991000+08:00,2022-09-13 20:27:23.805000+08:00,2022-09-13 20:33:39.903000+08:00,6.161388257615464,4.414020049226708,4.369167522252358,1.2604028528136217,2.688697777569623
2003472,1,2022-09-13,105,,2022-09-13 20:31:03.396000+08:00,2022-09-13 20:33:17.841000+08:00,2022-09-13 20:34:04.823000+08:00,2022-09-13 20:34:50.445000+08:00,2022-09-13 20:36:59.102000+08:00,5.436842544848902,3.265653290431892,3.7171730351300476,3.684486597211947,4.295691045918489
2003472,1,2022-09-13,106,,2022-09-13 20:48:42.574000+08:00,2022-09-13 20:50:45.114000+08:00,2022-09-13 20:51:21.664000+08:00,2022-09-13 20:51:56.806000+08:00,2022-09-13 20:53:13.230000+08:00,5.965042402009226,4.197727028483479,4.82570338081791,6.2026980024272165,5.645554058212204
2003472,1,2022-09-13,107,,2022-09-13 20:57:22.463000+08:00,2022-09-13 20:58:46.204000+08:00,2022-09-13 20:59:49.514000+08:00,2022-09-13 21:00:53.114000+08:00,2022-09-13 21:03:16.156000+08:00,8.728774387005297,2.423423201564858,2.666428745419859,3.3139566850120774,4.3201394406433895
2003472,1,2022-09-13,108,,2022-09-13 21:52:53.566000+08:00,2022-09-13 21:54:44.399000+08:00,2022-09-13 21:55:23.260000+08:00,2022-09-13 21:56:10.494000+08:00,2022-09-13 21:58:05.733000+08:00,6.595114234408621,3.9480950796703937,3.5903135074036294,4.113494495244645,4.8948257797252195
2003472,1,2022-09-13,109,,2022-09-13 21:57:20.167000+08:00,2022-09-13 21:59:49.162000+08:00,2022-09-13 22:00:33.317000+08:00,2022-09-13 22:01:58.885000+08:00,2022-09-13 22:03:45.024000+08:00,4.905911580537674,3.4747349765841045,1.9818725248773261,4.46617164414115,3.970313854703129
2003472,1,2022-09-13,110,,2022-09-13 22:12:09.677000+08:00,2022-09-13 22:13:40.155000+08:00,2022-09-13 22:14:06.164000+08:00,2022-09-13 22:14:36.977000+08:00,2022-09-13 22:15:39.756000+08:00,8.07882906278002,5.898993536509329,5.503679233073801,7.550852867001665,7.273468929209879
2003472,1,2022-09-13,111,,2022-09-13 22:16:34.595000+08:00,2022-09-13 22:18:05.167000+08:00,2022-09-13 22:18:36.989000+08:00,2022-09-13 22:19:13.837000+08:00,2022-09-13 22:20:24.676000+08:00,8.070444463434733,4.821410435895643,4.602281486341267,6.691723374659405,6.64115280783499
2003472,1,2022-09-13,112,,2022-09-13 22:28:06.202000+08:00,2022-09-13 22:30:04.134000+08:00,2022-09-13 22:30:31.139000+08:00,2022-09-13 22:31:12.641000+08:00,2022-09-13 22:33:17.806000+08:00,6.198116676917296,5.681426509574936,4.0861854418751635,3.787280726540946,4.903669655009186
2003472,1,2022-09-13,113,,2022-09-13 22:42:46.486000+08:00,2022-09-13 22:44:00.257000+08:00,2022-09-13 22:44:31.412000+08:00,2022-09-13 22:45:09.140000+08:00,2022-09-13 22:47:15.343000+08:00,9.908450420113738,4.924632415056046,4.494933953793019,3.756130933000781,5.683330094360504
2003472,1,2022-09-13,114,,2022-09-13 22:47:03.427000+08:00,2022-09-13 22:49:39.378000+08:00,2022-09-13 22:50:05.141000+08:00,2022-09-13 22:50:29.317000+08:00,2022-09-13 22:51:46.977000+08:00,4.6870895085136395,5.955320532976405,7.014595806117763,6.103978781064868,5.388831173265675
2003472,1,2022-09-13,115,,2022-09-13 23:00:32.147000+08:00,2022-09-13 23:02:51.515000+08:00,2022-09-13 23:03:30.996000+08:00,2022-09-13 23:04:05.824000+08:00,2022-09-13 23:05:41.447000+08:00,5.244792893219467,3.8860951569380497,4.8692106411135585,4.957332358715973,4.940197475523706
2003472,1,2022-09-13,116,,2022-09-13 23:12:20.966000+08:00,2022-09-13 23:14:19.155000+08:00,2022-09-13 23:14:48.937000+08:00,2022-09-13 23:15:12.265000+08:00,2022-09-13 23:16:29.953000+08:00,6.184638976065545,5.151666204118969,7.269584542554142,6.101778809307713,6.136878950224238
2003472,1,2022-09-13,117,,2022-09-13 23:19:16.955000+08:00,2022-09-13 23:21:06.300000+08:00,2022-09-13 23:21:36.835000+08:00,2022-09-13 23:22:02.952000+08:00,2022-09-13 23:23:11.991000+08:00,6.6848625537721045,5.024624951402362,6.493275192736647,6.866191458994156,6.501144842404917
2003472,1,2022-09-13,118,,2022-09-13 23:31:23.953000+08:00,2022-09-13 23:33:21.189000+08:00,2022-09-13 23:33:47.007000+08:00,2022-09-13 23:34:17.964000+08:00,2022-09-13 23:35:25.214000+08:00,6.2349133025880334,5.942633933343835,5.478078244297026,7.0488474667285885,6.333402743002318
