{
  "sessionAuthHost": "develop2.symphony.com",
  "sessionAuthPort": 443,
  "keyAuthHost": "develop2.symphony.com",
  "keyAuthPort": 443,
  "podHost": "develop2.symphony.com",
  "podPort": 443,
  "agentHost": "develop2.symphony.com",
  "agentPort": 443,
  "authType": "rsa",
  "botPrivateKeyPath":"./rsa/",
  "botPrivateKeyName": "develop-private-key.pem",
  "botCertPath": "",
  "botCertName": "",
  "botCertPassword": "",
  "botUsername": "chung-bot",
  "botEmailAddress": "chung-bot@symphony.com",
  "appCertPath": "",
  "appCertName": "",
  "appCertPassword": "",
  "authTokenRefreshPeriod": "30",
  "proxyURL": "",
  "proxyUsername": "",
  "proxyPassword": "",
  "podProxyURL": "",
  "podProxyUsername": "",
  "podProxyPassword": "",
  "agentProxyURL": "",
  "agentProxyUsername": "",
  "agentProxyPassword": "",
  "keyManagerProxyURL": "",
  "keyManagerProxyUsername": "",
  "keyManagerProxyPassword": "",
  "truststorePath": ""
}