[gd_scene load_steps=7 format=2]

[ext_resource path="res://src/Spider.gd" type="Script" id=1]
[ext_resource path="res://assets/sprites/dead.png" type="Texture" id=2]
[ext_resource path="res://assets/sprites/spider1.png" type="Texture" id=3]
[ext_resource path="res://assets/sprites/spider2.png" type="Texture" id=4]

[sub_resource type="SpriteFrames" id=1]
animations = [ {
"frames": [ ExtResource( 2 ) ],
"loop": false,
"name": "dead",
"speed": 0.0
}, {
"frames": [ ExtResource( 3 ), ExtResource( 4 ) ],
"loop": true,
"name": "move",
"speed": 4.0
} ]

[sub_resource type="RectangleShape2D" id=2]
extents = Vector2( 7.73535, 6.83391 )

[node name="Spider" type="KinematicBody2D"]
collision_layer = 2
collision_mask = 9
script = ExtResource( 1 )

[node name="AnimatedSprite" type="AnimatedSprite" parent="."]
frames = SubResource( 1 )
animation = "move"

[node name="CollisionShape2D" type="CollisionShape2D" parent="."]
position = Vector2( 0, -0.347214 )
shape = SubResource( 2 )

[node name="DeathTimer" type="Timer" parent="."]
wait_time = 4.0
one_shot = true
[connection signal="timeout" from="DeathTimer" to="." method="_on_DeathTimer_timeout"]
