[gd_scene load_steps=7 format=2]

[ext_resource path="res://entities/player/Weapon_Spray.gd" type="Script" id=1]
[ext_resource path="res://assets/graphics/sheet_sprites.sprites/rex_mini_launcher_original.tres" type="Texture" id=2]

[sub_resource type="Animation" id=1]
resource_name = "minilauncher_popup_left"
tracks/0/type = "value"
tracks/0/path = NodePath("Launcher:frame")
tracks/0/interp = 1
tracks/0/loop_wrap = true
tracks/0/imported = false
tracks/0/enabled = true
tracks/0/keys = {
"times": PoolRealArray( 0, 0.5, 0.7 ),
"transitions": PoolRealArray( 1, 1, 1 ),
"update": 1,
"values": [ 0, 1, 0 ]
}
tracks/1/type = "value"
tracks/1/path = NodePath("Launcher:position")
tracks/1/interp = 1
tracks/1/loop_wrap = true
tracks/1/imported = false
tracks/1/enabled = true
tracks/1/keys = {
"times": PoolRealArray( 0, 0.4, 0.7, 0.9 ),
"transitions": PoolRealArray( 1, 1, 1, 1 ),
"update": 0,
"values": [ Vector2( 18, -5 ), Vector2( 18, -25 ), Vector2( 18, -25 ), Vector2( 18, 5 ) ]
}
tracks/2/type = "value"
tracks/2/path = NodePath("Launcher:visible")
tracks/2/interp = 1
tracks/2/loop_wrap = true
tracks/2/imported = false
tracks/2/enabled = true
tracks/2/keys = {
"times": PoolRealArray( 0, 1 ),
"transitions": PoolRealArray( 1, 1 ),
"update": 1,
"values": [ true, false ]
}
tracks/3/type = "value"
tracks/3/path = NodePath("Launcher:rotation_degrees")
tracks/3/interp = 1
tracks/3/loop_wrap = true
tracks/3/imported = false
tracks/3/enabled = true
tracks/3/keys = {
"times": PoolRealArray( 0 ),
"transitions": PoolRealArray( 1 ),
"update": 0,
"values": [ 0.0 ]
}
tracks/4/type = "value"
tracks/4/path = NodePath("Launcher:scale")
tracks/4/interp = 1
tracks/4/loop_wrap = true
tracks/4/imported = false
tracks/4/enabled = true
tracks/4/keys = {
"times": PoolRealArray( 0 ),
"transitions": PoolRealArray( 1 ),
"update": 0,
"values": [ Vector2( 1, 1 ) ]
}

[sub_resource type="Animation" id=2]
resource_name = "minilauncher_popup_right"
tracks/0/type = "value"
tracks/0/path = NodePath("Launcher:frame")
tracks/0/interp = 1
tracks/0/loop_wrap = true
tracks/0/imported = false
tracks/0/enabled = true
tracks/0/keys = {
"times": PoolRealArray( 0, 0.5, 0.7 ),
"transitions": PoolRealArray( 1, 1, 1 ),
"update": 1,
"values": [ 0, 1, 0 ]
}
tracks/1/type = "value"
tracks/1/path = NodePath("Launcher:position")
tracks/1/interp = 1
tracks/1/loop_wrap = true
tracks/1/imported = false
tracks/1/enabled = true
tracks/1/keys = {
"times": PoolRealArray( 0, 0.4, 0.7, 0.9 ),
"transitions": PoolRealArray( 1, 1, 1, 1 ),
"update": 0,
"values": [ Vector2( -18, -5 ), Vector2( -18, -25 ), Vector2( -18, -25 ), Vector2( -18, 5 ) ]
}
tracks/2/type = "value"
tracks/2/path = NodePath("Launcher:visible")
tracks/2/interp = 1
tracks/2/loop_wrap = true
tracks/2/imported = false
tracks/2/enabled = true
tracks/2/keys = {
"times": PoolRealArray( 0, 1 ),
"transitions": PoolRealArray( 1, 1 ),
"update": 1,
"values": [ true, false ]
}
tracks/3/type = "value"
tracks/3/path = NodePath("Launcher:rotation_degrees")
tracks/3/interp = 1
tracks/3/loop_wrap = true
tracks/3/imported = false
tracks/3/enabled = true
tracks/3/keys = {
"times": PoolRealArray( 0 ),
"transitions": PoolRealArray( 1 ),
"update": 0,
"values": [ 0.0 ]
}
tracks/4/type = "value"
tracks/4/path = NodePath("Launcher:scale")
tracks/4/interp = 1
tracks/4/loop_wrap = true
tracks/4/imported = false
tracks/4/enabled = true
tracks/4/keys = {
"times": PoolRealArray( 0 ),
"transitions": PoolRealArray( 1 ),
"update": 0,
"values": [ Vector2( -1, 1 ) ]
}

[sub_resource type="Animation" id=3]
tracks/0/type = "value"
tracks/0/path = NodePath("Launcher:frame")
tracks/0/interp = 1
tracks/0/loop_wrap = true
tracks/0/imported = false
tracks/0/enabled = true
tracks/0/keys = {
"times": PoolRealArray( 0, 0.5, 0.7 ),
"transitions": PoolRealArray( 1, 1, 1 ),
"update": 1,
"values": [ 0, 1, 0 ]
}
tracks/1/type = "value"
tracks/1/path = NodePath("Launcher:visible")
tracks/1/interp = 1
tracks/1/loop_wrap = true
tracks/1/imported = false
tracks/1/enabled = true
tracks/1/keys = {
"times": PoolRealArray( 0, 1 ),
"transitions": PoolRealArray( 1, 1 ),
"update": 1,
"values": [ true, false ]
}
tracks/2/type = "value"
tracks/2/path = NodePath("Launcher:rotation_degrees")
tracks/2/interp = 1
tracks/2/loop_wrap = true
tracks/2/imported = false
tracks/2/enabled = true
tracks/2/keys = {
"times": PoolRealArray( 0, 0.4, 0.7, 0.9 ),
"transitions": PoolRealArray( 1, 1, 1, 1 ),
"update": 0,
"values": [ 184.6, 0.0, 0.0, 184.6 ]
}
tracks/3/type = "value"
tracks/3/path = NodePath("Launcher:position")
tracks/3/interp = 1
tracks/3/loop_wrap = true
tracks/3/imported = false
tracks/3/enabled = true
tracks/3/keys = {
"times": PoolRealArray( 0 ),
"transitions": PoolRealArray( 1 ),
"update": 0,
"values": [ Vector2( 19, -24 ) ]
}
tracks/4/type = "value"
tracks/4/path = NodePath("Launcher:scale")
tracks/4/interp = 1
tracks/4/loop_wrap = true
tracks/4/imported = false
tracks/4/enabled = true
tracks/4/keys = {
"times": PoolRealArray( 0 ),
"transitions": PoolRealArray( 1 ),
"update": 0,
"values": [ Vector2( 1, 1 ) ]
}

[sub_resource type="Animation" id=4]
resource_name = "minilauncher_swivel_right"
tracks/0/type = "value"
tracks/0/path = NodePath("Launcher:frame")
tracks/0/interp = 1
tracks/0/loop_wrap = true
tracks/0/imported = false
tracks/0/enabled = true
tracks/0/keys = {
"times": PoolRealArray( 0, 0.5, 0.7 ),
"transitions": PoolRealArray( 1, 1, 1 ),
"update": 1,
"values": [ 0, 1, 0 ]
}
tracks/1/type = "value"
tracks/1/path = NodePath("Launcher:visible")
tracks/1/interp = 1
tracks/1/loop_wrap = true
tracks/1/imported = false
tracks/1/enabled = true
tracks/1/keys = {
"times": PoolRealArray( 0, 1 ),
"transitions": PoolRealArray( 1, 1 ),
"update": 1,
"values": [ true, false ]
}
tracks/2/type = "value"
tracks/2/path = NodePath("Launcher:rotation_degrees")
tracks/2/interp = 1
tracks/2/loop_wrap = true
tracks/2/imported = false
tracks/2/enabled = true
tracks/2/keys = {
"times": PoolRealArray( 0, 0.4, 0.7, 0.9 ),
"transitions": PoolRealArray( 1, 1, 1, 1 ),
"update": 0,
"values": [ 189.2, 360.0, 360.0, 184.6 ]
}
tracks/3/type = "value"
tracks/3/path = NodePath("Launcher:position")
tracks/3/interp = 1
tracks/3/loop_wrap = true
tracks/3/imported = false
tracks/3/enabled = true
tracks/3/keys = {
"times": PoolRealArray( 0 ),
"transitions": PoolRealArray( 1 ),
"update": 0,
"values": [ Vector2( -19, -24 ) ]
}
tracks/4/type = "value"
tracks/4/path = NodePath("Launcher:scale")
tracks/4/interp = 1
tracks/4/loop_wrap = true
tracks/4/imported = false
tracks/4/enabled = true
tracks/4/keys = {
"times": PoolRealArray( 0 ),
"transitions": PoolRealArray( 1 ),
"update": 0,
"values": [ Vector2( -1, 1 ) ]
}

[node name="Weapon_Spray" type="Node2D"]
script = ExtResource( 1 )
weapon_type = 3

[node name="Launcher" type="Sprite" parent="."]
position = Vector2( -19, -24 )
rotation = 3.30216
scale = Vector2( -1, 1 )
texture = ExtResource( 2 )
offset = Vector2( 0, -12.053 )
hframes = 2

[node name="AnimationPlayer" type="AnimationPlayer" parent="."]
anims/minilauncher_popup_left = SubResource( 1 )
anims/minilauncher_popup_right = SubResource( 2 )
anims/minilauncher_swivel_left = SubResource( 3 )
anims/minilauncher_swivel_right = SubResource( 4 )

[node name="HomingDelayTimer" type="Timer" parent="."]
wait_time = 3.0
one_shot = true

[connection signal="timeout" from="HomingDelayTimer" to="." method="_on_HomingDelayTimer_timeout"]
