[gd_scene load_steps=3 format=2]

[ext_resource path="res://assets/graphics/sheet_dialogue.sprites/character-rex.tres" type="Texture" id=1]
[ext_resource path="res://addons/dialogic/Nodes/Portrait.gd" type="Script" id=2]

[node name="Portrait" type="Control"]
script = ExtResource( 2 )

[node name="TextureRect" type="TextureRect" parent="."]
margin_right = 379.0
margin_bottom = 383.0
texture = ExtResource( 1 )
__meta__ = {
"_edit_use_anchors_": false
}
