[gd_scene load_steps=6 format=2]

[ext_resource path="res://entities/player/Weapon_Bullets.tscn" type="PackedScene" id=1]
[ext_resource path="res://entities/player/Weapons.gd" type="Script" id=2]
[ext_resource path="res://entities/player/Weapon_Spray.tscn" type="PackedScene" id=3]
[ext_resource path="res://entities/player/Weapon_Laser.tscn" type="PackedScene" id=4]
[ext_resource path="res://entities/player/Weapon_Drone.tscn" type="PackedScene" id=5]

[node name="Weapons" type="Node2D"]
script = ExtResource( 2 )

[node name="Weapon_Single" parent="." instance=ExtResource( 1 )]
never_runs_out = true
level_never_decreases = true
weapon_order_index = 1
weapon_type = 1
make_sound = true

[node name="Weapon_Double" parent="." instance=ExtResource( 1 )]
max_ammo = 100
weapon_order_index = 2
weapon_type = 2
make_sound = true

[node name="Weapon_Laser" parent="." instance=ExtResource( 4 )]
max_ammo = 50
weapon_order_index = 3
weapon_type = 3

[node name="Weapon_Drone" parent="." instance=ExtResource( 5 )]
max_ammo = 50
weapon_order_index = 4
weapon_type = 4

[node name="Weapon_Spray" parent="." instance=ExtResource( 3 )]
position = Vector2( 0, 2 )
max_ammo = 50
weapon_order_index = 5
weapon_type = 5
