[gd_resource type="AtlasTexture" load_steps=2 format=2]

[ext_resource path="res://assets/graphics/sheet_sprites.png" type="Texture" id=1]

[resource]
flags = 7
atlas = ExtResource( 1 )
region = Rect2( 368, 0, 96, 64 )
