[gd_scene load_steps=4 format=2]

[ext_resource path="res://fireworks/Glitter.gd" type="Script" id=3]
[ext_resource path="res://fireworks/colors/0.tres" type="Gradient" id=4]

[sub_resource type="Gradient" id=1]
offsets = PoolRealArray( 0.113879, 0.133452, 0.153025, 0.25, 0.3, 0.35, 0.4, 0.45, 0.45, 0.55, 0.6, 0.65, 0.7, 0.75, 0.8, 0.85, 0.9, 0.95, 1 )
colors = PoolColorArray( 0, 0, 0, 0, 1, 0, 0, 1, 0, 0, 0, 0, 1, 0, 0, 1, 0, 0, 0, 0, 1, 0, 0, 1, 0, 0, 0, 0, 1, 0, 0, 1, 0, 0, 0, 0, 1, 0, 0, 1, 0, 0, 0, 0, 1, 0, 0, 1, 0, 0, 0, 0, 1, 0, 0, 1, 0, 0, 0, 0, 1, 0, 0, 1, 0, 0, 0, 0, 1, 0, 0, 1, 0, 0, 0, 0 )

[node name="Glitter" type="Node2D"]
script = ExtResource( 3 )

[node name="ParticlesExplosion" type="CPUParticles2D" parent="."]
visible = false
amount = 300
lifetime = 0.8
speed_scale = 1.8
explosiveness = 0.99
direction = Vector2( 0, 0 )
spread = 180.0
initial_velocity = 200.0
initial_velocity_random = 0.9
damping = 100.0
scale_amount = 4.0
color_ramp = ExtResource( 4 )
__meta__ = {
"_editor_description_": ""
}

[node name="ParticlesShower0" type="CPUParticles2D" parent="."]
emitting = false
amount = 200
lifetime = 4.0
explosiveness = 0.99
emission_shape = 1
emission_sphere_radius = 16.0
direction = Vector2( 0, 0 )
spread = 180.0
initial_velocity = 100.0
initial_velocity_random = 0.9
scale_amount = 4.0
color_ramp = SubResource( 1 )
__meta__ = {
"_editor_description_": ""
}

[node name="Timer" type="Timer" parent="."]
wait_time = 0.1
one_shot = true

[connection signal="timeout" from="Timer" to="." method="_on_Timer_timeout"]
