; Engine configuration file.
; It's best edited using the editor UI and not directly,
; since the parameters that go here are not all obvious.
;
; Format:
;   [section] ; section goes between []
;   param=value ; assign values to parameters

config_version=4

_global_script_classes=[ {
"base": "CanvasLayer",
"class": "DebugOverlay",
"language": "GDScript",
"path": "res://addons/debug-overlay/DebugOverlay.gd"
}, {
"base": "Resource",
"class": "DialogCharacterResource",
"language": "GDScript",
"path": "res://addons/dialogic/dialog_character_resource.gd"
}, {
"base": "Control",
"class": "DialogNode",
"language": "GDScript",
"path": "res://addons/dialogic/dialog_node.gd"
}, {
"base": "Control",
"class": "DialogNode_Rex",
"language": "GDScript",
"path": "res://dialogue/dialog_node_rex.gd"
}, {
"base": "Resource",
"class": "DialogResource",
"language": "GDScript",
"path": "res://addons/dialogic/dialog_resource.gd"
}, {
"base": "KinematicBody2D",
"class": "Enemy",
"language": "GDScript",
"path": "res://entities/base_classes/Enemy.gd"
}, {
"base": "Enemy",
"class": "Enemy_Launcher",
"language": "GDScript",
"path": "res://entities/static/Missile_Launcher.gd"
}, {
"base": "Node2D",
"class": "ExplosionBase",
"language": "GDScript",
"path": "res://entities/base_classes/Explosion.gd"
}, {
"base": "Area2D",
"class": "ExplosionCluster",
"language": "GDScript",
"path": "res://entities/base_classes/ExplosionCluster.gd"
}, {
"base": "Area2D",
"class": "Floaters",
"language": "GDScript",
"path": "res://entities/screen_based/Floaters.gd"
}, {
"base": "Enemy",
"class": "Human",
"language": "GDScript",
"path": "res://entities/screen_based/Human.gd"
}, {
"base": "Node2D",
"class": "MapMaster",
"language": "GDScript",
"path": "res://scenes/map_baseclass.gd"
}, {
"base": "Area2D",
"class": "Missile",
"language": "GDScript",
"path": "res://entities/projectiles/Missile_Launcher_Missile.gd"
}, {
"base": "KinematicBody2D",
"class": "Pickups",
"language": "GDScript",
"path": "res://entities/environment/DeadPickup.gd"
}, {
"base": "KinematicBody2D",
"class": "Player",
"language": "GDScript",
"path": "res://entities/player/Player.gd"
}, {
"base": "RichTextEffect",
"class": "RichTextMatrix",
"language": "GDScript",
"path": "res://assets/bbtext/CustomEffect.gd"
}, {
"base": "Node",
"class": "StateMachine",
"language": "GDScript",
"path": "res://entities/base_classes/state_machine.gd"
}, {
"base": "Area2D",
"class": "StraightProjectile",
"language": "GDScript",
"path": "res://entities/projectiles/StraightProjectile.gd"
}, {
"base": "Node2D",
"class": "Weapon",
"language": "GDScript",
"path": "res://entities/player/weapon.gd"
}, {
"base": "Node2D",
"class": "Weapons_System",
"language": "GDScript",
"path": "res://entities/player/Weapons.gd"
}, {
"base": "Area2D",
"class": "bunny_item",
"language": "GDScript",
"path": "res://Bunny/Item.gd"
} ]
_global_script_class_icons={
"DebugOverlay": "",
"DialogCharacterResource": "",
"DialogNode": "res://addons/dialogic/Images/icon.svg",
"DialogNode_Rex": "res://addons/dialogic/Images/icon.svg",
"DialogResource": "",
"Enemy": "",
"Enemy_Launcher": "",
"ExplosionBase": "",
"ExplosionCluster": "",
"Floaters": "",
"Human": "",
"MapMaster": "",
"Missile": "",
"Pickups": "",
"Player": "",
"RichTextMatrix": "",
"StateMachine": "",
"StraightProjectile": "",
"Weapon": "",
"Weapons_System": "",
"bunny_item": ""
}

[application]

config/name="Rex"
run/main_scene="res://scenes/Menu.tscn"
boot_splash/fullsize=false
boot_splash/use_filter=false
config/icon="res://icon.png"

[autoload]

AudioManager="*res://singletons/AudioManager.tscn"
IntegerResolutionHandler="*res://addons/integer_resolution_handler/integer_resolution_handler.gd"
GlobalMethods="*res://singletons/GlobalMethods.gd"
Globals="*res://singletons/Globals.gd"
GlobalTileMap="*res://singletons/TileMap.gd"
OptionsAndAchievements="*res://singletons/OptionsAndAchievements.tscn"
GlobalPersist="*res://singletons/GlobalPersist.gd"
SceneManager="*res://singletons/SceneManager.tscn"
DialogueOverlay="*res://singletons/DialogueOverlay.tscn"

[display]

window/integer_resolution_handler/base_width=960
window/integer_resolution_handler/base_height=768
window/size/width=960
window/size/height=768
window/energy_saving/keep_screen_on=false
mouse_cursor/custom_image="res://assets/graphics/ui/menu/mouse.png"
window/stretch/mode="viewport"
window/stretch/aspect="keep"

[editor_plugins]

enabled=PoolStringArray( "res://addons/codeandweb.texturepacker/plugin.cfg", "res://addons/dialogic/plugin.cfg", "res://addons/integer_resolution_handler/plugin.cfg" )

[gdnative]

singletons=[  ]

[importer_defaults]

texture={
"compress/bptc_ldr": 0,
"compress/hdr_mode": 0,
"compress/lossy_quality": 0.7,
"compress/mode": 0,
"compress/normal_map": 0,
"detect_3d": false,
"flags/anisotropic": false,
"flags/filter": false,
"flags/mipmaps": false,
"flags/repeat": 0,
"flags/srgb": 2,
"process/HDR_as_SRGB": false,
"process/fix_alpha_border": true,
"process/invert_color": false,
"process/normal_map_invert_y": false,
"process/premult_alpha": false,
"size_limit": 0,
"stream": false,
"svg/scale": 1.0
}
ogg_vorbis={
"loop": false,
"loop_offset": 0
}

[input]

ui_accept={
"deadzone": 0.5,
"events": [ Object(InputEventKey,"resource_local_to_scene":false,"resource_name":"","device":0,"alt":false,"shift":false,"control":false,"meta":false,"command":false,"pressed":false,"scancode":16777221,"physical_scancode":0,"unicode":0,"echo":false,"script":null)
, Object(InputEventKey,"resource_local_to_scene":false,"resource_name":"","device":0,"alt":false,"shift":false,"control":false,"meta":false,"command":false,"pressed":false,"scancode":16777222,"physical_scancode":0,"unicode":0,"echo":false,"script":null)
, Object(InputEventJoypadButton,"resource_local_to_scene":false,"resource_name":"","device":0,"button_index":0,"pressure":0.0,"pressed":false,"script":null)
, Object(InputEventKey,"resource_local_to_scene":false,"resource_name":"","device":0,"alt":false,"shift":false,"control":false,"meta":false,"command":false,"pressed":false,"scancode":16777238,"physical_scancode":0,"unicode":0,"echo":false,"script":null)
, Object(InputEventMouseButton,"resource_local_to_scene":false,"resource_name":"","device":0,"alt":false,"shift":false,"control":false,"meta":false,"command":false,"button_mask":0,"position":Vector2( 0, 0 ),"global_position":Vector2( 0, 0 ),"factor":1.0,"button_index":1,"pressed":false,"doubleclick":false,"script":null)
 ]
}
ui_top={
"deadzone": 0.5,
"events": [ Object(InputEventKey,"resource_local_to_scene":false,"resource_name":"","device":0,"alt":false,"shift":false,"control":false,"meta":false,"command":false,"pressed":false,"scancode":16777232,"physical_scancode":0,"unicode":0,"echo":false,"script":null)
, Object(InputEventJoypadButton,"resource_local_to_scene":false,"resource_name":"","device":0,"button_index":12,"pressure":0.0,"pressed":false,"script":null)
 ]
}
walk_right={
"deadzone": 0.5,
"events": [ Object(InputEventKey,"resource_local_to_scene":false,"resource_name":"","device":0,"alt":false,"shift":false,"control":false,"meta":false,"command":false,"pressed":false,"scancode":16777233,"physical_scancode":0,"unicode":0,"echo":false,"script":null)
, Object(InputEventJoypadButton,"resource_local_to_scene":false,"resource_name":"","device":0,"button_index":15,"pressure":0.0,"pressed":false,"script":null)
 ]
}
walk_left={
"deadzone": 0.5,
"events": [ Object(InputEventKey,"resource_local_to_scene":false,"resource_name":"","device":0,"alt":false,"shift":false,"control":false,"meta":false,"command":false,"pressed":false,"scancode":16777231,"physical_scancode":0,"unicode":0,"echo":false,"script":null)
, Object(InputEventJoypadButton,"resource_local_to_scene":false,"resource_name":"","device":0,"button_index":14,"pressure":0.0,"pressed":false,"script":null)
 ]
}
jump={
"deadzone": 0.5,
"events": [ Object(InputEventKey,"resource_local_to_scene":false,"resource_name":"","device":0,"alt":false,"shift":false,"control":false,"meta":false,"command":false,"pressed":false,"scancode":16777232,"physical_scancode":0,"unicode":0,"echo":false,"script":null)
, Object(InputEventJoypadButton,"resource_local_to_scene":false,"resource_name":"","device":0,"button_index":0,"pressure":0.0,"pressed":false,"script":null)
 ]
}
fire={
"deadzone": 0.5,
"events": [ Object(InputEventJoypadButton,"resource_local_to_scene":false,"resource_name":"","device":-1,"button_index":2,"pressure":0.0,"pressed":false,"script":null)
, Object(InputEventMouseButton,"resource_local_to_scene":false,"resource_name":"","device":0,"alt":false,"shift":false,"control":false,"meta":false,"command":false,"button_mask":0,"position":Vector2( 0, 0 ),"global_position":Vector2( 0, 0 ),"factor":1.0,"button_index":1,"pressed":false,"doubleclick":false,"script":null)
, Object(InputEventKey,"resource_local_to_scene":false,"resource_name":"","device":0,"alt":false,"shift":false,"control":false,"meta":false,"command":false,"pressed":false,"scancode":16777238,"physical_scancode":0,"unicode":0,"echo":false,"script":null)
 ]
}
shield={
"deadzone": 0.5,
"events": [ Object(InputEventKey,"resource_local_to_scene":false,"resource_name":"","device":0,"alt":false,"shift":false,"control":false,"meta":false,"command":false,"pressed":false,"scancode":16777234,"physical_scancode":0,"unicode":0,"echo":false,"script":null)
, Object(InputEventJoypadButton,"resource_local_to_scene":false,"resource_name":"","device":0,"button_index":4,"pressure":0.0,"pressed":false,"script":null)
, Object(InputEventJoypadButton,"resource_local_to_scene":false,"resource_name":"","device":0,"button_index":5,"pressure":0.0,"pressed":false,"script":null)
 ]
}
debug={
"deadzone": 0.5,
"events": [ Object(InputEventKey,"resource_local_to_scene":false,"resource_name":"","device":0,"alt":false,"shift":false,"control":false,"meta":false,"command":false,"pressed":false,"scancode":96,"physical_scancode":0,"unicode":0,"echo":false,"script":null)
 ]
}
smart_bomb={
"deadzone": 0.5,
"events": [ Object(InputEventJoypadButton,"resource_local_to_scene":false,"resource_name":"","device":0,"button_index":3,"pressure":0.0,"pressed":false,"script":null)
, Object(InputEventMouseButton,"resource_local_to_scene":false,"resource_name":"","device":0,"alt":false,"shift":false,"control":false,"meta":false,"command":false,"button_mask":0,"position":Vector2( 0, 0 ),"global_position":Vector2( 0, 0 ),"factor":1.0,"button_index":2,"pressed":false,"doubleclick":false,"script":null)
, Object(InputEventKey,"resource_local_to_scene":false,"resource_name":"","device":0,"alt":false,"shift":false,"control":false,"meta":false,"command":false,"pressed":false,"scancode":67,"physical_scancode":0,"unicode":0,"echo":false,"script":null)
 ]
}
temp_w2={
"deadzone": 0.5,
"events": [ Object(InputEventKey,"resource_local_to_scene":false,"resource_name":"","device":0,"alt":false,"shift":false,"control":false,"meta":false,"command":false,"pressed":false,"scancode":16777245,"physical_scancode":0,"unicode":0,"echo":false,"script":null)
 ]
}
temp_w3={
"deadzone": 0.5,
"events": [ Object(InputEventKey,"resource_local_to_scene":false,"resource_name":"","device":0,"alt":false,"shift":false,"control":false,"meta":false,"command":false,"pressed":false,"scancode":16777246,"physical_scancode":0,"unicode":0,"echo":false,"script":null)
 ]
}
temp_w4={
"deadzone": 0.5,
"events": [ Object(InputEventKey,"resource_local_to_scene":false,"resource_name":"","device":0,"alt":false,"shift":false,"control":false,"meta":false,"command":false,"pressed":false,"scancode":16777247,"physical_scancode":0,"unicode":0,"echo":false,"script":null)
 ]
}
temp_w5={
"deadzone": 0.5,
"events": [ Object(InputEventKey,"resource_local_to_scene":false,"resource_name":"","device":0,"alt":false,"shift":false,"control":false,"meta":false,"command":false,"pressed":false,"scancode":16777248,"physical_scancode":0,"unicode":0,"echo":false,"script":null)
 ]
}
temp_w6={
"deadzone": 0.5,
"events": [ Object(InputEventKey,"resource_local_to_scene":false,"resource_name":"","device":0,"alt":false,"shift":false,"control":false,"meta":false,"command":false,"pressed":false,"scancode":16777249,"physical_scancode":0,"unicode":0,"echo":false,"script":null)
 ]
}
temp_w7={
"deadzone": 0.5,
"events": [ Object(InputEventKey,"resource_local_to_scene":false,"resource_name":"","device":0,"alt":false,"shift":false,"control":false,"meta":false,"command":false,"pressed":false,"scancode":16777250,"physical_scancode":0,"unicode":0,"echo":false,"script":null)
 ]
}
bunny_beginner={
"deadzone": 0.5,
"events": [ Object(InputEventKey,"resource_local_to_scene":false,"resource_name":"","device":0,"alt":false,"shift":false,"control":false,"meta":false,"command":false,"pressed":false,"scancode":66,"physical_scancode":0,"unicode":0,"echo":false,"script":null)
 ]
}
bunny_expert={
"deadzone": 0.5,
"events": [ Object(InputEventKey,"resource_local_to_scene":false,"resource_name":"","device":0,"alt":false,"shift":false,"control":false,"meta":false,"command":false,"pressed":false,"scancode":69,"physical_scancode":0,"unicode":0,"echo":false,"script":null)
 ]
}
bunny_quit={
"deadzone": 0.5,
"events": [ Object(InputEventKey,"resource_local_to_scene":false,"resource_name":"","device":0,"alt":false,"shift":false,"control":false,"meta":false,"command":false,"pressed":false,"scancode":81,"physical_scancode":0,"unicode":0,"echo":false,"script":null)
 ]
}
bunny_continue={
"deadzone": 0.5,
"events": [ Object(InputEventKey,"resource_local_to_scene":false,"resource_name":"","device":0,"alt":false,"shift":false,"control":false,"meta":false,"command":false,"pressed":false,"scancode":16777221,"physical_scancode":0,"unicode":0,"echo":false,"script":null)
 ]
}
achievement_interface_open_close={
"deadzone": 0.5,
"events": [ Object(InputEventKey,"resource_local_to_scene":false,"resource_name":"","device":0,"alt":false,"shift":false,"control":false,"meta":false,"command":false,"pressed":false,"scancode":16777217,"physical_scancode":0,"unicode":0,"echo":false,"script":null)
, Object(InputEventJoypadButton,"resource_local_to_scene":false,"resource_name":"","device":0,"button_index":11,"pressure":0.0,"pressed":false,"script":null)
 ]
}
debug_screen_down={
"deadzone": 0.5,
"events": [ Object(InputEventKey,"resource_local_to_scene":false,"resource_name":"","device":0,"alt":false,"shift":true,"control":false,"meta":false,"command":false,"pressed":false,"scancode":16777234,"physical_scancode":0,"unicode":0,"echo":false,"script":null)
 ]
}
debug_screen_up={
"deadzone": 0.5,
"events": [ Object(InputEventKey,"resource_local_to_scene":false,"resource_name":"","device":0,"alt":false,"shift":true,"control":false,"meta":false,"command":false,"pressed":false,"scancode":16777232,"physical_scancode":0,"unicode":0,"echo":false,"script":null)
 ]
}
debug_screen_left={
"deadzone": 0.5,
"events": [ Object(InputEventKey,"resource_local_to_scene":false,"resource_name":"","device":0,"alt":false,"shift":true,"control":false,"meta":false,"command":false,"pressed":false,"scancode":16777231,"physical_scancode":0,"unicode":0,"echo":false,"script":null)
 ]
}
debug_screen_right={
"deadzone": 0.5,
"events": [ Object(InputEventKey,"resource_local_to_scene":false,"resource_name":"","device":0,"alt":false,"shift":true,"control":false,"meta":false,"command":false,"pressed":false,"scancode":16777233,"physical_scancode":0,"unicode":0,"echo":false,"script":null)
 ]
}
options_game={
"deadzone": 0.5,
"events": [ Object(InputEventKey,"resource_local_to_scene":false,"resource_name":"","device":0,"alt":false,"shift":false,"control":false,"meta":false,"command":false,"pressed":false,"scancode":71,"physical_scancode":0,"unicode":0,"echo":false,"script":null)
 ]
}
options_achievements={
"deadzone": 0.5,
"events": [ Object(InputEventKey,"resource_local_to_scene":false,"resource_name":"","device":0,"alt":false,"shift":false,"control":false,"meta":false,"command":false,"pressed":false,"scancode":65,"physical_scancode":0,"unicode":0,"echo":false,"script":null)
 ]
}
options_log={
"deadzone": 0.5,
"events": [ Object(InputEventKey,"resource_local_to_scene":false,"resource_name":"","device":0,"alt":false,"shift":false,"control":false,"meta":false,"command":false,"pressed":false,"scancode":76,"physical_scancode":0,"unicode":0,"echo":false,"script":null)
 ]
}
options_bunny={
"deadzone": 0.5,
"events": [ Object(InputEventKey,"resource_local_to_scene":false,"resource_name":"","device":0,"alt":false,"shift":false,"control":false,"meta":false,"command":false,"pressed":false,"scancode":66,"physical_scancode":0,"unicode":0,"echo":false,"script":null)
 ]
}
options_highscore={
"deadzone": 0.5,
"events": [ Object(InputEventKey,"resource_local_to_scene":false,"resource_name":"","device":0,"alt":false,"shift":false,"control":false,"meta":false,"command":false,"pressed":false,"scancode":72,"physical_scancode":0,"unicode":0,"echo":false,"script":null)
 ]
}
options_options={
"deadzone": 0.5,
"events": [ Object(InputEventKey,"resource_local_to_scene":false,"resource_name":"","device":0,"alt":false,"shift":false,"control":false,"meta":false,"command":false,"pressed":false,"scancode":79,"physical_scancode":0,"unicode":0,"echo":false,"script":null)
 ]
}
mouse={
"deadzone": 0.5,
"events": [  ]
}
temp_invincible={
"deadzone": 0.5,
"events": [ Object(InputEventKey,"resource_local_to_scene":false,"resource_name":"","device":0,"alt":false,"shift":false,"control":false,"meta":false,"command":false,"pressed":false,"scancode":0,"physical_scancode":16777244,"unicode":0,"echo":false,"script":null)
 ]
}

[layer_names]

2d_physics/layer_1="player"
2d_physics/layer_2="environment"
2d_physics/layer_3="foreground"
2d_physics/layer_4="enemy"
2d_physics/layer_5="invisible_blocker01"
2d_physics/layer_6="enemy_blocked_by_tile"
2d_physics/layer_7="conveyer_belt"
2d_physics/layer_8="player_spawn_centre"
2d_physics/layer_9="player_hurtbox"
2d_physics/layer_10="enemy_hurtbox"
2d_physics/layer_11="soft_collison"
2d_physics/layer_12="floater_area"
2d_physics/layer_13="environment_oneway"
2d_physics/layer_14="environment_destroyable"
2d_physics/layer_15="enemy_human"
2d_physics/layer_16="player_weapon"
2d_physics/layer_17="enemy_weapon"
2d_physics/layer_18="instant_kill"
2d_physics/layer_19="enemy_weapon_pipe_check"

[logging]

file_logging/enable_file_logging=true

[memory]

limits/message_queue/max_size_kb=102400

[network]

limits/debugger_stdout/max_chars_per_second=65535

[rendering]

2d/snapping/use_gpu_pixel_snap=true
environment/default_clear_color=Color( 0, 0, 0, 1 )
environment/default_environment="res://default_env.tres"
quality/dynamic_fonts/use_oversampling=false
quality/2d/use_pixel_snap=true
