[gd_scene load_steps=4 format=2]

[ext_resource path="res://assets/graphics/sprites/environment/invisible_blocker.png" type="Texture" id=1]
[ext_resource path="res://entities/static/InvisibleBlocker.gd" type="Script" id=2]

[sub_resource type="RectangleShape2D" id=1]
extents = Vector2( 18, 16 )

[node name="InvisibleBlocker" type="StaticBody2D"]
z_index = 5
collision_layer = 16
collision_mask = 0
script = ExtResource( 2 )

[node name="Sprite" type="Sprite" parent="."]
position = Vector2( -2.14577e-06, 5.9 )
scale = Vector2( 1.0625, 0.93125 )
texture = ExtResource( 1 )

[node name="CollisionShape2D" type="CollisionShape2D" parent="."]
position = Vector2( 0, 6 )
shape = SubResource( 1 )
