[gd_scene load_steps=3 format=2]

[ext_resource path="res://entities/static/ExitShip.gd" type="Script" id=1]

[sub_resource type="RectangleShape2D" id=1]
extents = Vector2( 236, 40 )

[node name="ExitShip" type="Area2D"]
position = Vector2( 248, 12025 )
collision_layer = 0
script = ExtResource( 1 )

[node name="CollisionShape2D" type="CollisionShape2D" parent="."]
shape = SubResource( 1 )

[connection signal="body_entered" from="." to="." method="_on_ExitShip_body_entered"]
