[gd_scene load_steps=6 format=2]

[ext_resource path="res://entities/projectiles/StraightProjectile.tscn" type="PackedScene" id=1]
[ext_resource path="res://assets/graphics/sheet_sprites.sprites/bullets_original.tres" type="Texture" id=2]

[sub_resource type="CircleShape2D" id=1]
radius = 6.0

[sub_resource type="CircleShape2D" id=2]
radius = 6.0

[sub_resource type="CircleShape2D" id=3]
radius = 6.0

[node name="RoofTurretMissile" instance=ExtResource( 1 )]
collision_layer = 8
collision_mask = 266242
hits_environment = true

[node name="Sprite" parent="." index="0"]
texture = ExtResource( 2 )
region_enabled = true
region_rect = Rect2( 192, 0, 48, 32 )

[node name="EnvironmentalCollisionShape2D" parent="." index="2"]
position = Vector2( 0, 2 )
shape = SubResource( 1 )

[node name="Hitbox" parent="." index="3"]
collision_mask = 256
damage_given = 5

[node name="CollisionShape2D" parent="Hitbox" index="0"]
position = Vector2( 0, 2 )
shape = SubResource( 2 )

[node name="Hurtbox" parent="." index="4"]
collision_layer = 65536

[node name="CollisionShape2D" parent="Hurtbox" index="0"]
position = Vector2( 0, 2 )
shape = SubResource( 3 )

[connection signal="take_hit" from="Hurtbox" to="." method="_on_Hurtbox_take_hit"]

[editable path="Hitbox"]
[editable path="Hurtbox"]
