[gd_resource type="Shader" format=2]

[resource]
code = "shader_type canvas_item;

uniform bool dissolve=false;
uniform float dissolve_value : hint_range(0,1);
uniform sampler2D noise_texture;


void fragment() {
	vec4 orig = texture(TEXTURE,UV);
	if(dissolve) {
		vec4 noise_pixel = texture(noise_texture,UV);
		vec4 current_pixel = texture(TEXTURE, UV);
		if(noise_pixel.r >= dissolve_value)
		{
			current_pixel.a-=1.0f;
			current_pixel.a = max(current_pixel.a, 0.0);
			COLOR=current_pixel;
		}
		else 
		{
			//COLOR.a=orig.a;
			COLOR=orig;
		}
	}
	else 
	{
		COLOR=orig;
	}
}

"
