[gd_scene load_steps=2 format=2]

[sub_resource type="CircleShape2D" id=1]
radius = 45.0111

[node name="SafeZone" type="Area2D"]
collision_layer = 0
collision_mask = 2

[node name="CollisionShape2D" type="CollisionShape2D" parent="."]
shape = SubResource( 1 )
