[gd_scene load_steps=7 format=2]

[ext_resource path="res://assets/fonts/font_weapons.tres" type="DynamicFont" id=1]
[ext_resource path="res://assets/graphics/sheet_ui.sprites/weapon_inlays_original1.tres" type="Texture" id=2]
[ext_resource path="res://assets/graphics/sheet_ui.sprites/weapon_inlays_original6.tres" type="Texture" id=3]
[ext_resource path="res://ui/UIWeapons.gd" type="Script" id=4]
[ext_resource path="res://assets/shaders/white_to_new_colour.shader" type="Shader" id=5]

[sub_resource type="ShaderMaterial" id=1]
resource_local_to_scene = true
shader = ExtResource( 5 )
shader_param/new_colour = Color( 0.764706, 0.823529, 0.0666667, 1 )

[node name="UIWeapons" type="Control"]
margin_right = 64.0
margin_bottom = 84.0
rect_min_size = Vector2( 64, 64 )
script = ExtResource( 4 )

[node name="ColorRectBackground" type="ColorRect" parent="."]
modulate = Color( 1, 1, 1, 0.941176 )
margin_left = 12.0
margin_right = 52.0
margin_bottom = 64.0
color = Color( 0, 0, 0.752941, 1 )
__meta__ = {
"_edit_use_anchors_": false
}

[node name="BackOverlay" type="TextureRect" parent="."]
margin_right = 64.0
margin_bottom = 84.0
texture = ExtResource( 3 )
__meta__ = {
"_edit_use_anchors_": false
}

[node name="TextureRectIcon" type="TextureRect" parent="."]
material = SubResource( 1 )
margin_right = 192.0
margin_bottom = 192.0
texture = ExtResource( 2 )
__meta__ = {
"_edit_use_anchors_": false
}

[node name="LabelValue" type="Label" parent="."]
margin_top = 5.0
margin_right = 64.0
margin_bottom = 21.0
custom_colors/font_color = Color( 0, 0, 0, 1 )
custom_fonts/font = ExtResource( 1 )
text = "99"
align = 1
__meta__ = {
"_edit_use_anchors_": false
}

[node name="Timer" type="Timer" parent="."]
wait_time = 0.2
one_shot = true

[connection signal="timeout" from="Timer" to="." method="_on_Timer_timeout"]
