[gd_resource type="GradientTexture" load_steps=2 format=2]

[ext_resource path="res://entities/particles/DieRespawnParticlesDeath_Colour.tres" type="Gradient" id=1]

[resource]
gradient = ExtResource( 1 )
