0,1,2,2,3,2,4,5,6,7,8,9,2,3,2,0,1,2,10,9,2,2,11,0,2,3,2,10,9,2, 
12,10,13,14,15,16,17,0,18,9,19,8,9,2,16,12,10,2,10,19,10,2,7,0,9,2,16,10,19,10, 
20,8,21,22,23,2,3,24,25,7,7,8,2,3,2,20,8,19,6,10,26,27,2,11,2,3,2,6,10,6, 
10,9,28,29,30,2,10,9,2,7,8,31,32,33,34,6,20,7,10,9,35,36,3,2,34,32,33,6,2,7, 
10,19,10,9,2,16,10,19,10,9,19,37,38,0,39,40,20,6,10,19,10,9,2,16,39,38,0,41,2,2, 
6,10,6,2,42,2,6,10,6,7,7,37,43,0,0,41,44,6,6,10,6,2,3,2,0,43,0,0,0,6, 
19,3,2,40,42,40,6,20,7,6,2,45,0,0,46,0,0,0,33,34,33,33,34,41,0,0,0,0,0,46, 
19,7,8,41,47,41,0,20,6,6,9,44,0,48,49,46,0,0,0,39,0,26,27,0,0,46,48,50,48,49, 
7,3,2,0,51,0,0,0,6,45,0,0,46,49,46,0,0,0,0,0,0,0,0,0,48,49,46,49,49,46, 
2,3,2,52,0,0,0,0,12,52,0,0,0,48,0,0,0,0,0,0,0,0,0,46,49,46,48,46,46,0, 
9,2,16,17,0,0,0,0,0,0,0,0,0,0,0,0,0,0,0,0,0,0,0,0,46,46,49,46,0,0, 
2,3,2,11,0,0,0,0,0,0,0,0,0,0,0,0,0,0,53,0,0,53,0,0,0,0,46,0,0,0, 
4,5,6,0,0,0,0,0,0,0,0,0,0,0,46,0,0,0,54,0,0,54,0,0,0,0,0,0,0,0, 
17,0,18,55,56,57,24,0,0,5,56,24,0,48,49,46,5,56,58,59,60,61,56,24,0,0,0,0,0,0, 
3,24,25,45,62,63,0,0,0,0,41,0,46,49,46,48,50,0,64,0,0,64,0,0,0,5,24,0,0,0, 
6,2,45,0,0,0,0,0,0,0,0,0,0,46,0,46,49,46,0,0,0,0,0,0,0,0,0,0,1,2, 
6,9,44,0,0,0,0,65,0,0,0,0,0,0,0,0,46,0,0,0,0,0,0,0,0,0,0,12,10,2, 
45,0,0,0,0,0,66,67,68,42,69,70,42,69,69,0,0,0,0,0,0,0,0,0,42,69,70,20,8,19, 
2,11,0,0,1,2,10,9,2,2,3,2,2,3,2,17,0,0,0,0,0,0,1,2,7,8,9,2,3,2, 
2,7,0,12,10,2,10,19,10,26,27,16,9,71,16,2,52,0,72,73,69,12,10,2,9,19,8,26,27,16, 
2,2,11,20,8,19,6,10,6,35,36,2,2,3,2,9,2,17,2,6,20,20,8,19,7,7,8,35,36,2, 
