[gd_resource type="ParticlesMaterial" load_steps=3 format=2]

[sub_resource type="Gradient" id=1]
offsets = PoolRealArray( 0.290909, 0.690909, 1 )
colors = PoolColorArray( 0.768627, 0.2, 0.2, 1, 0.741176, 0.615686, 0.129412, 1, 0.588235, 0.552941, 0.14902, 1 )

[sub_resource type="GradientTexture" id=2]
gradient = SubResource( 1 )

[resource]
lifetime_randomness = 0.3
emission_shape = 2
emission_box_extents = Vector3( 2, 1, 1 )
direction = Vector3( 100, 0, 0 )
spread = 180.0
gravity = Vector3( 0, 88, 0 )
angular_velocity = 180.0
radial_accel = -6.2
radial_accel_random = 0.81
scale = 4.0
color_ramp = SubResource( 2 )
