[gd_resource type="AnimatedTexture" load_steps=7 format=2]

[ext_resource path="res://assets/graphics/tilesets/spinning_spawn/rex_level1_spinning_spawnpoint_32x32_animated2.png" type="Texture" id=1]
[ext_resource path="res://assets/graphics/tilesets/spinning_spawn/rex_level1_spinning_spawnpoint_32x32_animated1.png" type="Texture" id=2]
[ext_resource path="res://assets/graphics/tilesets/spinning_spawn/rex_level1_spinning_spawnpoint_32x32_animated6.png" type="Texture" id=3]
[ext_resource path="res://assets/graphics/tilesets/spinning_spawn/rex_level1_spinning_spawnpoint_32x32_animated5.png" type="Texture" id=4]
[ext_resource path="res://assets/graphics/tilesets/spinning_spawn/rex_level1_spinning_spawnpoint_32x32_animated3.png" type="Texture" id=5]
[ext_resource path="res://assets/graphics/tilesets/spinning_spawn/rex_level1_spinning_spawnpoint_32x32_animated4.png" type="Texture" id=6]

[resource]
frames = 6
fps = 12.0
frame_0/texture = ExtResource( 2 )
frame_1/texture = ExtResource( 1 )
frame_1/delay_sec = 0.0
frame_2/texture = ExtResource( 5 )
frame_2/delay_sec = 0.0
frame_3/texture = ExtResource( 6 )
frame_3/delay_sec = 0.0
frame_4/texture = ExtResource( 4 )
frame_4/delay_sec = 0.0
frame_5/texture = ExtResource( 3 )
frame_5/delay_sec = 0.0
