.....
----------------------------------------------------------------------
Ran 5 tests in 0.000s

OK
Name               Stmts   Miss Branch BrPart  Cover   Missing
--------------------------------------------------------------
Army.py               17      0      4      0   100%
Diplomacy.py          50      0     30      0   100%
TestDiplomacy.py      31      0      0      0   100%
--------------------------------------------------------------
TOTAL                 98      0     34      0   100%
